program: Gaussian 09
title: 000245843
version: EM64L-G09RevD.01
frameworkgroup: C1[X(C17H16N2O2)]
method: RPBEPBE
basis: SDD
operation: Freq
keyword: #p
keyword: freq=noraman
keyword: PBEPBE/SDD
title: #p freq=noraman PBEPBE/SDD
converged: YES YES NO NO
title: Mulliken charges:
elementType: O O N N C C C C C C C C C C C C C C C C C H H H H H H H H H H H H H H H H
charge: -0.209130 -0.211171 -0.213440 -0.381875 -0.463954 0.188930 0.190160 0.109253 0.102511 0.324147 0.296221 -0.353383 -0.353417 -0.528002 0.460944 -0.390003 -0.443616 -0.209843 -0.209450 -0.846955 -0.820888 0.259319 0.268060 0.328816 0.262551 0.270178 0.269359 0.221699 0.227919 0.239894 0.239525 0.230611 0.226198 0.236928 0.232003 0.218210 0.231695
chargesum: 0.00000
title: Mulliken charges with hydrogens summed into heavy atoms:
elementType: O O N N C C C C C C C C C C C C C C C C C
charge: -0.209130 -0.211171 -0.213440 -0.053060 0.063425 0.188930 0.190160 0.109253 0.102511 0.324147 0.296221 -0.083205 -0.084059 -0.265451 0.460944 -0.168305 -0.215697 0.030051 0.030075 -0.153218 -0.138981
polarizability: 2.34695259e+02 -3.34928603e+00 2.29138833e+02 9.89878892e+00 7.16463221e+00 1.43243616e+02
1716.lowfreq: -8.5306 -6.6757 -0.0007 -0.0004 0.0002 3.0725 19.9125 29.8371 39.7178
frequency: 19.8668 29.5985 39.7068 42.6786 77.8742 115.5238 130.3378 138.7430 157.0220 180.7624 184.3418 228.5724 240.9746 264.3226 281.7374 313.7591 324.2335 347.2011 395.0633 413.0586 448.4496 452.2387 454.5611 485.2098 506.7677 523.0375 552.6326 569.7811 589.3112 616.2992 659.3663 681.6233 695.4089 707.3518 725.2141 729.2071 755.8148 787.3163 797.3206 805.4799 841.0924 880.0475 907.0455 910.8003 917.4974 936.1549 971.5269 974.8996 999.0781 1007.0045 1012.4248 1018.6957 1041.7799 1046.7774 1072.0069 1081.1777 1129.1454 1160.9114 1163.1845 1172.0091 1182.9139 1192.8773 1220.8393 1269.0409 1283.2024 1292.1385 1319.8619 1327.5642 1376.6888 1394.2027 1395.6372 1396.8285 1416.7403 1433.8065 1452.0431 1453.6077 1458.7324 1464.9698 1473.6801 1474.5538 1479.0257 1490.8758 1530.7755 1593.7360 1613.8953 1616.0039 1625.3120 1629.2957 1673.0503 2948.3221 2972.5588 3015.4836 3033.3511 3053.1232 3081.8477 3082.6176 3094.6850 3113.5566 3132.3202 3140.1860 3141.5993 3153.3896 3164.7801 3174.9566 3569.7391
redmass: 5.7442 4.1998 5.2007 1.0284 6.4400 4.2914 3.4828 5.0543 5.9051 5.7045 1.1228 3.7762 6.2646 3.8814 2.6773 3.2203 6.6877 3.5334 3.3057 3.2127 3.3135 3.3912 4.7235 1.5581 3.1292 7.1608 3.9114 3.8063 3.9864 6.5449 4.7860 6.6357 5.3541 4.9701 3.1378 3.2190 3.8885 5.1975 1.7397 1.2612 5.6960 1.4003 1.4036 5.0837 3.2789 1.3412 2.0041 1.4152 1.6550 1.3485 2.0857 1.8456 1.5196 1.5403 2.6587 3.7917 2.0671 1.7079 1.5290 1.9948 2.6046 2.6543 1.7779 3.4654 1.4980 1.6032 2.3576 1.3407 4.2482 1.3847 1.2647 1.2980 5.4426 2.4925 2.6313 2.4604 1.3083 1.1526 1.0694 1.0549 1.3058 1.2711 2.2020 5.3177 7.6602 8.2617 9.1916 6.3983 11.8241 1.0401 1.0384 1.0968 1.0590 1.0949 1.0953 1.0998 1.1064 1.0872 1.0913 1.0864 1.0965 1.0906 1.0956 1.1004 1.0761
irintensity: 0.3919 0.1799 0.2129 0.3149 4.2140 1.4818 1.0969 0.0341 5.1463 1.0170 2.3455 0.1713 0.2350 4.6319 0.7669 3.5318 17.3229 2.1595 9.5718 2.6991 2.9998 15.8365 1.0540 54.0777 63.2372 8.7424 16.4455 19.8469 4.3093 45.1177 0.4506 0.7135 17.9410 3.8319 52.0458 40.7419 0.0002 1.1644 23.2699 41.8377 5.5784 17.1394 0.1853 16.3040 10.1629 0.8826 46.0826 2.3359 5.5538 0.0023 7.2112 11.8845 1.1456 23.2598 12.0091 46.0225 25.8493 55.2244 6.2516 10.4379 114.4539 8.3927 6.3607 460.7405 1.5742 52.5732 55.1038 6.9105 14.2106 30.8844 16.5915 8.8222 13.2169 30.2648 1.8917 10.9051 11.9363 22.1934 16.3368 13.0769 53.8422 16.3470 100.7405 82.6521 1.8346 154.3162 190.7106 121.4084 73.8124 42.3735 37.7551 27.4423 29.8351 22.7479 15.8414 25.8657 2.1794 16.2695 7.3267 1.6137 26.1806 4.9125 5.6143 21.2834 24.6776
temp: 298.150 k
press: 1.00000 atm
elementType: 8 8 7 7 6 6 6 6 6 6 6 6 6 6 6 6 6 6 6 6 6 1 1 1 1 1 1 1 1 1 1 1 1 1 1 1 1
symmnumber: 1
zpe: 766300.5 jmol-1
zpe.correction: 0.291868 hartree
zpe.thermalcorrener: 0.310622 hartree
zpe.thermalcorrenthalpy: 0.311566 hartree
zpe.thermalcorrgfe: 0.243152 hartree
zpe.sumelectzpe: -915.922612 hartree
zpe.sumelectthermal: -915.903858 hartree
zpe.sumelectthermalent: -915.902914 hartree
zpe.sumelectthermalfe: -915.971329 hartree
dipole: -3.2082 -0.1255 -1.1888
dipole: 3.4236
quadrupole: -105.0455 -121.8623 -121.0399
quadrupole: -6.7028 5.4480 -3.4828
quadrupole: 10.9371 -5.8797 -5.0574 -6.7028 5.4480 -3.4828
hfenergy: -916.2144805 hartree
pointgroup: C01 [X(C17H16N2O2)]
dipole: 1.2823321 -0.1332118 0.3901182 debye
polarizability: 234.6855415|-0.1931785|208.2453322|6.7249351|38.3936536|164.146835 unknown
InChI: InChI=1S/C17H16N2O2/c1-11-7-8-12(2)15(9-11)18-10-19-16(20)13-5-3-4-6-14(13)17(19)21/h3-9,18H,10H2,1-2H3
charge 0 multiplicity 1
37 atoms
O  0.437733 2.501719 -0.421464
O  1.584324 -1.855019 -1.78904
N  0.732369 0.308465 -1.304032
N  -1.444388 -0.769286 -1.749027
C  -0.479814 0.213801 -2.172726
C  2.349493 1.029325 0.209048
C  2.697692 -0.282251 -0.200252
C  1.084197 1.426412 -0.491222
C  1.665405 -0.75977 -1.176011
C  -2.371744 -0.592552 -0.69693
C  -3.214503 -1.695508 -0.341738
C  3.135072 1.743282 1.125379
C  3.844136 -0.921892 0.293727
C  -2.497778 0.643744 -0.008651
C  -3.458113 0.819279 1.016813
C  -4.157932 -1.505571 0.690422
C  -4.289887 -0.271412 1.367373
C  4.297334 1.104315 1.631452
C  4.646333 -0.207611 1.221927
C  -3.094295 -3.026721 -1.062694
C  -3.594241 2.164333 1.712054
H  -0.913639 1.227529 -2.195503
H  -0.129914 -0.051753 -3.184601
H  -1.264344 -1.724802 -2.056091
H  -1.839734 1.485046 -0.253361
H  2.855249 2.755218 1.434334
H  4.103642 -1.93513 -0.028544
H  -4.804639 -2.346701 0.969903
H  -5.032253 -0.159274 2.165928
H  4.935655 1.629957 2.349582
H  5.548981 -0.674819 1.629933
H  -3.292012 -2.928016 -2.149276
H  -2.085908 -3.476861 -0.950084
H  -3.81842 -3.755166 -0.661173
H  -4.296315 2.825019 1.166516
H  -3.982506 2.049771 2.739633
H  -2.625532 2.692001 1.766198
