program: Gaussian 09
title: 000245787
version: EM64L-G09RevD.01
frameworkgroup: C1[X(C10H8BrNO3)]
method: RPBEPBE
basis: SDD
operation: Freq
keyword: #p
keyword: freq=noraman
keyword: PBEPBE/SDD
title: #p freq=noraman PBEPBE/SDD
converged: YES YES NO YES
title: Mulliken charges:
elementType: Br O O O N C C C C C C C C C C H H H H H H H H
charge: 0.017304 -0.255513 -0.415738 -0.244960 -0.471729 0.496017 -0.436820 -0.329192 -0.149003 -0.162614 -0.238278 0.239004 -0.298755 -0.209604 0.171660 0.230873 0.317103 0.312502 0.252952 0.252712 0.246385 0.291858 0.383837
chargesum: 0.00000
title: Mulliken charges with hydrogens summed into heavy atoms:
elementType: Br O O O N C C C C C C C C C C
charge: 0.017304 -0.255513 -0.031901 -0.244960 -0.159227 0.496017 -0.205947 -0.012089 0.103948 0.090098 -0.238278 0.239004 -0.052371 0.082254 0.171660
polarizability: 3.44017533e+02 -9.44157233e+00 1.28247620e+02 -1.93927592e-03 -3.19889611e-04 5.24008849e+01
1716.lowfreq: -6.7692 -0.0004 0.0006 0.0007 3.6219 4.1459 25.1410 45.1867 51.7517
frequency: 25.1339 45.0346 51.7517 69.0673 115.7852 127.5376 159.3981 185.3111 205.8475 231.5615 282.7835 332.4681 336.5137 365.1794 409.2951 482.7897 510.8112 574.5656 578.2569 619.0479 630.0056 645.4805 652.3537 708.7006 730.3349 740.7693 817.3691 827.7816 850.2428 910.0012 921.8029 945.5147 968.9081 988.2606 989.5998 996.0007 1058.7155 1061.7731 1117.6113 1149.4688 1187.1979 1219.8134 1257.4913 1290.8187 1310.8951 1328.5765 1361.7510 1398.6036 1472.6621 1498.0192 1584.4730 1596.8070 1604.4645 1630.3144 1661.1866 3110.0219 3120.7581 3167.4721 3170.6215 3175.5364 3197.7491 3520.2417 3522.4451
redmass: 10.0265 6.4807 9.0473 7.3124 5.7920 10.6519 3.8428 10.7750 3.4734 7.2447 10.9055 6.4613 4.6489 6.7502 2.9794 4.7184 2.6354 1.6251 6.0412 6.7522 6.6827 1.2049 1.9722 3.4559 8.4606 6.7463 1.3988 5.4981 1.4173 2.1765 5.5766 1.3632 4.2329 1.3243 4.8898 1.0888 2.2988 2.4214 1.3482 2.0520 1.1127 1.4528 2.2166 1.3102 1.5948 2.4869 4.5803 4.4999 2.3774 2.3103 8.6696 5.7680 3.9013 8.7077 6.1774 1.0921 1.0906 1.0912 1.0927 1.0949 1.0955 1.0641 1.0765
irintensity: 0.0591 1.0261 0.1572 4.3819 6.1922 3.1263 0.0001 1.9523 0.1506 4.4386 0.0576 12.4036 0.0320 16.0539 0.0024 31.3678 55.5236 59.6001 39.0809 10.9763 15.1328 68.6218 64.7450 2.5022 37.3855 23.0641 39.6426 0.4736 62.8715 2.3925 5.9548 1.4152 10.7674 5.7617 63.0558 62.2750 350.8104 149.6733 15.8559 9.0356 0.6253 38.9648 3.8007 3.9970 32.5303 190.3920 112.4860 18.8707 81.3562 292.3482 98.0474 25.6594 66.1104 246.5178 70.4723 2.6104 11.6455 3.0497 2.5609 3.5032 9.7956 68.6749 16.4594
temp: 298.150 k
press: 1.00000 atm
elementType: 35 8 8 8 7 6 6 6 6 6 6 6 6 6 6 1 1 1 1 1 1 1 1
symmnumber: 1
zpe: 423518.4 jmol-1
zpe.correction: 0.161310 hartree
zpe.thermalcorrener: 0.175418 hartree
zpe.thermalcorrenthalpy: 0.176362 hartree
zpe.thermalcorrgfe: 0.117423 hartree
zpe.sumelectzpe: -678.683698 hartree
zpe.sumelectthermal: -678.669590 hartree
zpe.sumelectthermalent: -678.668646 hartree
zpe.sumelectthermalfe: -678.727585 hartree
dipole: 1.1739 2.4886 0.0010
dipole: 2.7516
quadrupole: -93.4409 -94.2813 -99.5058
quadrupole: -2.3735 0.0047 0.0001
quadrupole: 2.3018 1.4613 -3.7631 -2.3735 0.0047 0.0001
hfenergy: -678.8450077 hartree
pointgroup: C01 [X(C10H8Br1N1O3)]
dipole: 0.4458724 -0.9864627 -0.0001665 debye
dipolederiv: -0.9492809 0.0589791 -0.0000186 0.1071019 -0.0673376 -0.0000651 0.0003791 -0.0000717 -0.0305658 -0.6354601 0.0852046 -0.0000711 -0.4880621 -0.8449851 0.0002652 -0.0002676 -0.0002278 -0.3445334 -1.296782 -0.5813895 0.0000626 -0.6124313 -0.6350533 0.0000212 0.001076 0.0007619 -0.4297034 -0.93399 0.1484547 -0.0001407 0.339256 -0.903545 0.0007882 0.0002127 -0.0004422 -0.3293035 -1.3509955 -0.275727 -0.000083 -0.3587782 -0.392832 -0.0001041 0.0000036 -0.0001266 -0.3173022 0.8234512 -0.0103431 -0.000041 -0.1834731 -0.0035758 0.0000223 -0.0001642 0.0000227 0.1097234 -0.0184791 -0.0133807 -0.0000155 0.063872 0.0520569 -0.0000541 -0.0001193 -0.0000402 -0.1970735 -0.1000401 0.0127995 -0.0000221 -0.0965767 -0.0546723 -0.0000635 0.0000282 -0.0000183 -0.1510794 -0.4387841 0.0875727 -0.0000143 0.2597088 0.0530358 0.0000472 -0.0000888 -0.0000414 -0.0786406 -0.4391232 -0.049424 0.000048 -0.094014 0.0850195 -0.0000324 0.0001313 -0.0000068 -0.0808175 1.4716958 -0.1395127 -0.0000404 -0.2351392 -0.0138264 -0.0000595 -0.00048 0.0000531 -0.1429211 1.2987774 0.1771242 0.0002352 0.7999336 1.0557582 -0.0001942 0.0010241 0.0001854 0.2373431 0.2798593 0.0691625 0.000122 0.1900201 0.0560098 -0.0000499 -0.0006057 -0.0000493 -0.1457521 -1.1000856 0.0031267 -0.0000928 0.0694955 0.0353415 -0.0000756 -0.0008208 0.0000472 -0.0892511 2.4876118 0.2694757 0.0000451 -0.1729015 1.2488794 -0.0008569 -0.0000279 -0.0004023 0.2492272 0.0082771 0.1074367 -0.0000172 0.0823221 -0.0501431 0.0000718 0.000023 0.0000444 0.1714809 0.1436398 -0.048867 0.0000334 -0.0070595 0.0803631 0.0000331 0.0000539 0.0000001 0.1839565 0.1580858 -0.0089633 0.0000217 0.0881155 0.1137326 0.0000699 0.0001102 0.0001288 0.3150508 0.0267688 -0.0752099 0.0000187 -0.0801413 0.0085862 0.0000543 -0.0000293 0.0000605 0.1616312 0.0561374 0.0517173 -0.0000063 0.0715471 -0.016148 0.0000461 0.0000621 0.0000162 0.1567212 0.0577695 -0.0078739 -0.0000575 0.0230753 -0.0457775 0.0000503 -0.0001717 0.0000944 0.1715321 0.1275459 0.0251847 -0.0000548 0.0614529 0.037487 0.0000424 -0.0003066 0.000045 0.1751007 0.3234007 0.1144526 0.0000886 0.1726757 0.2016261 0.0000431 -0.0000224 -0.0000329 0.4051765 unknown
polarizability: 344.2675302|5.9277712|127.997617|0.0217261|-0.0163059|52.4008902 unknown
InChI: InChI=1S/C10H8BrNO3/c11-7-1-3-8(4-2-7)12-9(13)5-6-10(14)15/h1-6,12,14H
charge 0 multiplicity 1
23 atoms
Br -6.195659 0.268941 -0.000113
O  0.832328 1.608587 -0.000146
O  5.832276 0.764802 0.00023
O  5.048547 -1.430064 0.000942
N  -0.053807 -0.576899 -0.000327
C  -1.451379 -0.326776 -0.000281
C  -2.319229 -1.453118 0.000094
C  -2.003592 0.983376 -0.000603
C  -3.7171 -1.284414 0.000149
C  -3.404507 1.150982 -0.000548
C  -4.248989 0.022715 -0.000176
C  0.996384 0.349812 -0.000609
C  2.343399 -0.295129 0.000275
C  3.480953 0.45248 0.00086
C  4.812081 -0.196343 0.001831
H  -1.905596 -2.469437 0.00035
H  -1.338011 1.8480 -0.000912
H  0.216637 -1.563879 -0.000068
H  -4.377208 -2.155935 0.000438
H  -3.827336 2.159451 -0.000803
H  2.429243 -1.391204 0.000539
H  3.430996 1.545964 0.000657
H  6.716465 0.307091 -0.00038
