program: Gaussian 09
title: 000245789
version: EM64L-G09RevD.01
frameworkgroup: C1[X(C15H15NO4)]
method: RPBEPBE
basis: SDD
operation: Freq
keyword: #p
keyword: freq=noraman
keyword: PBEPBE/SDD
title: #p freq=noraman PBEPBE/SDD
converged: YES YES NO NO
title: Mulliken charges:
elementType: O O O O N C C C C C C C C C C C C C C C H H H H H H H H H H H H H H H
charge: -0.231965 -0.420559 -0.248385 -0.229773 -0.454857 -0.343542 -0.214492 -0.170832 -0.239078 -0.212041 -0.203524 0.208277 0.150859 0.316335 0.265473 -0.343911 -0.382226 -0.846620 -0.235032 -0.247780 0.282848 0.322692 0.257919 0.291917 0.251916 0.256547 0.335267 0.384146 0.306661 0.229100 0.227145 0.247844 0.232342 0.228885 0.228447
chargesum: 0.00000
title: Mulliken charges with hydrogens summed into heavy atoms:
elementType: O O O O N C C C C C C C C C C C C C C C
charge: -0.231965 -0.036413 -0.248385 -0.229773 -0.119590 -0.060695 0.108200 0.087088 0.052839 0.039874 0.053023 0.208277 0.150859 0.316335 0.265473 -0.037250 -0.153126 -0.139290 -0.006147 -0.019334
polarizability: 2.49695695e+02 2.72256027e+00 1.44599454e+02 6.13573113e+00 2.18548259e+01 1.40594764e+02
1716.lowfreq: -0.6706 -0.0008 -0.0007 -0.0005 5.2234 7.3792 17.3176 29.7910 35.1543
frequency: 15.7410 29.7718 35.1440 73.7817 79.5635 87.8940 130.0596 148.3805 177.5045 189.4337 203.1325 237.4204 288.1268 300.3644 310.2292 357.1681 413.8665 423.6147 446.2874 477.0649 504.1147 529.5284 545.9849 557.2410 592.5962 618.9999 641.9214 650.1606 668.3768 704.8003 719.9294 730.7889 741.8850 770.1789 778.4165 800.0157 807.5904 826.0905 832.6590 868.9768 883.4237 899.7316 917.1934 926.7273 956.4914 962.8236 969.0910 977.3712 979.6109 986.8585 998.2991 1038.4774 1042.2572 1047.4680 1083.4689 1098.1212 1111.7145 1150.0143 1168.9651 1174.5916 1175.6736 1197.4827 1209.9881 1214.5525 1248.1661 1257.9034 1272.7637 1291.7174 1295.2824 1303.2583 1307.1856 1348.5617 1378.1616 1395.8893 1439.7104 1453.5345 1481.5656 1487.9219 1517.6534 1584.8520 1595.6253 1618.4651 1621.5616 1656.6619 2953.6677 2998.8792 3022.4298 3050.2827 3088.1963 3123.3732 3125.1405 3138.8932 3150.6084 3161.7909 3190.2195 3194.1713 3222.1894 3508.0227 3534.3645
redmass: 5.1536 5.3746 10.5286 4.7273 6.3079 5.4071 4.9251 5.2404 3.8452 1.0947 3.9868 5.8892 4.2991 4.5886 5.7095 5.0664 3.8546 4.3440 2.9736 3.2186 4.2850 4.2038 3.3528 4.0684 4.6436 3.1640 1.3203 2.0277 2.6607 2.5161 4.9352 2.7256 4.3363 1.3842 6.2126 5.5876 4.7298 3.0625 5.0453 3.6817 1.3029 2.9286 2.7330 2.0445 1.3695 4.6117 2.2034 3.1042 1.6138 3.9940 1.3093 2.5065 1.5299 2.1177 1.8968 1.4457 1.9108 1.1861 1.7079 1.1735 1.4401 1.9519 1.2860 1.2743 1.3836 1.4420 1.9905 1.7379 1.6264 1.8157 1.9304 1.8700 5.1652 1.2752 2.3202 1.8433 1.0446 1.4263 2.0314 6.1814 6.4640 6.2538 4.2767 9.2842 1.0400 1.0820 1.0978 1.0853 1.0946 1.0872 1.0915 1.0902 1.0932 1.0985 1.0884 1.0951 1.1112 1.0638 1.0756
irintensity: 0.5494 0.1978 1.8198 1.2813 4.9772 0.0773 2.2545 2.2330 3.8641 1.1916 6.6521 1.3881 2.7788 3.6834 9.7723 5.7752 1.3673 0.9887 9.0356 9.5534 22.9572 16.9772 3.0707 15.3226 10.2927 31.5204 70.4329 54.4066 51.6639 39.4346 6.3977 3.2713 5.1018 86.8342 11.9992 11.9056 3.1167 124.1782 2.6489 8.2702 2.6698 9.4597 12.5660 6.7473 3.3451 2.1772 2.4813 46.2248 8.9556 36.1376 1.6425 12.6357 6.4212 17.4400 169.7966 2.7967 1.1081 3.0457 110.8579 6.3886 10.3723 6.1995 6.0538 0.4500 8.9772 1.5220 25.5242 9.4152 41.1549 25.9151 31.9123 12.5912 76.5831 24.0653 75.3826 135.0256 15.3667 56.6561 330.8103 3.1469 95.4596 2.7832 76.5344 285.2152 31.6347 23.4033 21.4494 6.6409 18.3951 8.3033 21.7070 18.1903 4.5888 28.7744 1.4186 8.5224 3.8381 21.9366 23.8875
temp: 298.150 k
press: 1.00000 atm
elementType: 8 8 8 8 7 6 6 6 6 6 6 6 6 6 6 6 6 6 6 6 1 1 1 1 1 1 1 1 1 1 1 1 1 1 1
symmnumber: 1
zpe: 714791.9 jmol-1
zpe.correction: 0.272250 hartree
zpe.thermalcorrener: 0.289718 hartree
zpe.thermalcorrenthalpy: 0.290662 hartree
zpe.thermalcorrgfe: 0.224656 hartree
zpe.sumelectzpe: -934.774464 hartree
zpe.sumelectthermal: -934.756996 hartree
zpe.sumelectthermalent: -934.756051 hartree
zpe.sumelectthermalfe: -934.822057 hartree
dipole: 3.2275 1.3216 1.8321
dipole: 3.9395
quadrupole: -123.8722 -107.1199 -117.2275
quadrupole: 4.9347 7.7843 4.2831
quadrupole: -7.7990 8.9533 -1.1543 4.9347 7.7843 4.2831
hfenergy: -935.0467136 hartree
pointgroup: C01 [X(C15H15N1O4)]
dipole: 1.2592108 -0.2869095 0.8569306 debye
polarizability: 249.510026|-0.3520675|121.6626725|7.645337|-6.7705333|163.7172142 unknown
InChI: InChI=1S/C15H15NO4/c1-8-4-2-3-5-9(8)16-14(17)12-10-6-7-11(20-10)13(12)15(18)19/h2-7,10-13,16,18H,1H3
charge 0 multiplicity 1
35 atoms
O  -3.192952 -1.749692 0.390067
O  -2.269949 1.891325 1.729522
O  0.006102 0.582759 -1.568308
O  -4.398329 1.739256 0.823545
N  1.119779 -0.150251 0.372267
C  -1.31742 -0.337714 0.282518
C  -2.565932 0.458133 -0.212326
C  -1.766856 -1.837009 -0.042888
C  -3.560721 -0.706589 -0.622947
C  -1.893399 -1.999999 -1.560455
C  -3.010835 -1.310127 -1.915753
C  -0.014469 0.091041 -0.399616
C  -3.198165 1.390413 0.802638
C  2.492808 0.072439 0.053733
C  3.459635 -0.229104 1.065698
C  2.90333 0.570775 -1.210614
C  4.825658 -0.020099 0.769255
C  3.039878 -0.757093 2.428688
C  4.275596 0.767602 -1.471723
C  5.244132 0.473749 -0.487294
H  -1.231591 -0.255727 1.379073
H  -2.285855 1.064932 -1.096426
H  -1.242935 -2.616623 0.524358
H  -4.625078 -0.457252 -0.550635
H  -1.167361 -2.498548 -2.203355
H  -3.401836 -1.115728 -2.915334
H  0.940214 -0.508381 1.312596
H  -2.732743 2.535115 2.332539
H  2.146465 0.800753 -1.96222
H  5.572003 -0.248326 1.539561
H  2.50524 -1.726466 2.359195
H  3.922774 -0.925358 3.066652
H  2.383342 -0.045842 2.969964
H  4.583111 1.153531 -2.449824
H  6.309261 0.62691 -0.690652
