program: Gaussian 09
title: 000245763
version: EM64L-G09RevD.01
frameworkgroup: C1[X(C13H19NS)]
method: RPBEPBE
basis: SDD
operation: Freq
keyword: #p
keyword: freq=noraman
keyword: PBEPBE/SDD
title: #p freq=noraman PBEPBE/SDD
converged: YES YES NO NO
title: Mulliken charges:
elementType: S N C C C C C C C C C C C C C H H H H H H H H H H H H H H H H H H H
charge: 0.179931 -0.050163 -0.396419 -0.386011 -0.388286 -0.351852 -0.372862 -0.660209 -0.200871 -0.269824 -0.177124 0.444088 -0.377366 -0.397265 -0.807073 0.216819 0.189704 0.196287 0.207280 0.202764 0.195757 0.177266 0.234001 0.216622 0.187117 0.247758 0.269955 0.247135 0.284906 0.229051 0.227600 0.223203 0.235022 0.223056
chargesum: 0.00000
title: Mulliken charges with hydrogens summed into heavy atoms:
elementType: S N C C C C C C C C C C C C C
charge: 0.179931 -0.050163 0.010104 0.017556 0.010235 0.059416 0.030877 -0.142495 -0.200871 -0.022688 0.107782 0.444088 -0.148315 -0.169665 -0.125791
polarizability: 2.21749907e+02 9.99397982e+00 1.66129668e+02 3.04771842e+00 -3.88072031e-01 1.08530946e+02
1716.lowfreq: -24.7598 -7.8007 -0.0009 -0.0002 0.0015 9.6431 20.5886 25.5126 34.6306
frequency: -9.8513 20.4428 34.5957 41.8242 89.7490 100.0738 147.5227 180.3562 223.7698 246.2393 292.8112 320.3248 331.6162 354.8731 363.6242 386.7721 407.8200 436.5030 451.8794 497.2195 539.7341 602.9405 631.8341 656.4908 711.0513 741.1383 785.4063 802.4965 819.7972 849.1939 853.2472 855.0904 882.4461 946.3229 954.6544 956.2782 984.3411 985.6866 990.6207 1006.1315 1046.1302 1046.6615 1071.9892 1078.4657 1100.8449 1115.2359 1123.9330 1148.8453 1163.5895 1181.1017 1189.0944 1219.1516 1253.8947 1264.7140 1273.5926 1290.4152 1298.2230 1301.8415 1330.7758 1338.0288 1347.1581 1355.9030 1357.9764 1376.9265 1396.4216 1396.7789 1439.1770 1449.0728 1458.7035 1464.6703 1467.4986 1471.1772 1474.5230 1476.9862 1481.6335 1572.8736 1606.7261 2839.5448 2847.5367 2917.3388 2965.9277 2972.5864 2982.7464 2986.4632 3023.2293 3028.4780 3036.1239 3045.2793 3053.2677 3054.4592 3079.1377 3082.3050 3114.9189 3119.1716 3141.4034 3149.5298
redmass: 3.1442 3.7089 3.6014 1.0313 4.1184 3.7332 4.7793 3.0907 2.2715 2.3131 3.7803 2.3695 3.3538 5.8212 1.7753 3.5673 2.9389 3.4500 2.9754 2.7109 1.7542 5.3748 6.8920 5.4139 3.4534 3.6723 4.9626 1.4734 1.3532 2.2916 1.3186 1.4681 1.9363 1.7356 1.3047 1.3833 1.3894 1.3710 2.5263 3.9946 1.9729 1.6174 2.8871 1.4079 2.1689 1.3225 2.4219 1.2775 2.4698 1.2274 1.1277 2.8978 1.2722 1.2193 1.2090 1.5733 1.3287 1.4186 1.3033 1.4198 1.4813 1.4190 4.8533 1.4344 2.9613 1.2691 1.1021 1.0934 1.0872 1.0978 1.0839 1.0919 1.0537 1.1496 2.1533 6.1144 6.1522 1.0708 1.0700 1.0679 1.0634 1.0386 1.0613 1.0616 1.0880 1.0894 1.0946 1.1032 1.0949 1.1038 1.0944 1.0996 1.0887 1.0883 1.0960 1.0963
irintensity: 0.5860 0.2966 0.3253 0.5386 0.1732 2.4385 1.6788 0.0699 2.5268 0.7043 0.8134 5.9329 0.1729 2.0914 2.1964 1.2670 0.5078 4.2963 0.0553 23.2864 0.8316 3.5505 1.5725 51.0180 0.4483 4.9443 1.9329 0.1889 50.5779 0.7486 2.9843 6.5181 0.4527 17.5059 1.2131 1.2614 0.4880 1.0206 72.9260 13.9507 3.4216 24.3787 29.1371 10.2307 62.8204 5.1611 3.7071 6.1487 66.2481 2.0746 4.0660 0.8448 7.3564 2.2875 43.5093 30.7538 0.7112 12.5697 0.4905 0.8837 1.7523 0.6300 0.3952 5.6366 2.5221 7.5506 7.7925 6.1383 14.3591 16.9377 5.1540 13.6035 12.3988 2.5740 76.6663 0.3634 2.5026 49.0088 194.9738 87.9832 43.6861 44.7604 25.4906 27.5444 54.4547 29.9851 43.6001 28.4852 24.0529 102.4526 12.1990 18.5664 16.5474 16.8588 12.2239 12.8277
temp: 298.150 k
press: 1.00000 atm
elementType: 16 7 6 6 6 6 6 6 6 6 6 6 6 6 6 1 1 1 1 1 1 1 1 1 1 1 1 1 1 1 1 1 1 1
symmnumber: 1
zpe: 761740.7 jmol-1
zpe.correction: 0.290132 hartree
zpe.thermalcorrener: 0.304708 hartree
zpe.thermalcorrenthalpy: 0.305652 hartree
zpe.thermalcorrgfe: 0.246632 hartree
zpe.sumelectzpe: -958.436943 hartree
zpe.sumelectthermal: -958.422367 hartree
zpe.sumelectthermalent: -958.421423 hartree
zpe.sumelectthermalfe: -958.480443 hartree
dipole: 1.2461 -1.7517 1.1689
dipole: 2.4470
quadrupole: -85.4180 -97.7171 -100.3544
quadrupole: 1.9888 0.8053 1.5589
quadrupole: 9.0785 -3.2206 -5.8579 1.9888 0.8053 1.5589
hfenergy: -958.7270751 hartree
pointgroup: C01 [X(C13H19N1S1)]
dipole: -0.5347412 0.6692743 0.439233 debye
polarizability: 220.8407157|7.8568916|165.2467034|12.9546613|5.5813183|110.3231018 unknown
InChI: InChI=1S/C13H19NS/c1-12-5-7-13(8-6-12)15-11-14-9-3-2-4-10-14/h5-8H,2-4,9-11H2,1H3
charge 0 multiplicity 1
34 atoms
S  0.079851 -2.287331 -0.281686
N  -2.020739 -0.411612 0.129166
C  -4.056534 1.471657 -0.817694
C  -3.374298 0.466838 -1.773523
C  -3.110897 1.815553 0.356242
C  -2.896956 -0.782509 -1.006788
C  -2.65266 0.535114 1.084486
C  -1.359175 -1.547418 0.753508
C  1.419023 -1.065265 0.046932
C  2.720985 -1.553257 0.313233
C  1.187903 0.330958 0.007356
C  3.568888 0.755672 0.514274
C  3.781984 -0.647107 0.53483
C  2.254152 1.223749 0.255967
C  4.717981 1.725115 0.734259
H  -4.346344 2.390367 -1.361721
H  -4.990729 1.024755 -0.417678
H  -4.067871 0.157894 -2.578849
H  -2.498942 0.946357 -2.252912
H  -2.218832 2.345304 -0.031732
H  -3.612396 2.487219 1.079413
H  -3.788032 -1.360839 -0.64692
H  -2.31678 -1.4454 -1.67533
H  -1.912407 0.783498 1.868344
H  -3.537439 0.072258 1.593601
H  -2.015517 -2.435215 0.898974
H  -0.928791 -1.249287 1.723181
H  2.898634 -2.633192 0.359876
H  0.179499 0.697072 -0.214574
H  4.786372 -1.03826 0.739711
H  2.062923 2.304223 0.23362
H  5.49165 1.293798 1.394137
H  5.211023 1.983695 -0.223414
H  4.370472 2.669995 1.188611
