program: Gaussian 09
title: 000245740
version: EM64L-G09RevD.01
frameworkgroup: C1[X(C15H17NOS)]
method: RPBEPBE
basis: SDD
operation: Freq
keyword: #p
keyword: freq=noraman
keyword: PBEPBE/SDD
title: #p freq=noraman PBEPBE/SDD
converged: YES YES NO NO
title: Mulliken charges:
elementType: S O N C C C C C C C C C C C C C C C H H H H H H H H H H H H H H H H H
charge: 0.192377 -0.246610 -0.077895 -0.322475 -0.353099 -0.314312 -0.307383 -0.662571 -0.224954 0.372902 0.381715 -0.345616 -0.283353 -0.408794 -0.421428 -0.409095 -0.241741 -0.242253 0.197520 0.234171 0.215511 0.208826 0.197632 0.219049 0.218536 0.188314 0.253854 0.271837 0.295056 0.249297 0.237788 0.235190 0.237320 0.227225 0.227459
chargesum: 0.00000
title: Mulliken charges with hydrogens summed into heavy atoms:
elementType: S O N C C C C C C C C C C C C C C C
charge: 0.192377 -0.246610 -0.077895 0.109215 0.071237 0.102369 0.099467 -0.136880 -0.224954 0.372902 0.381715 -0.050560 -0.034056 -0.171006 -0.186238 -0.171775 -0.014516 -0.014794
polarizability: 2.58623750e+02 2.67002699e+01 2.17824875e+02 4.01011504e+00 -5.77795100e+00 1.09069813e+02
1716.lowfreq: -28.0550 -15.7396 -0.9423 -0.0016 0.0010 0.0014 8.4583 22.3235 29.5896
frequency: -21.4281 21.3076 29.3991 83.4540 95.7581 139.4541 168.9441 179.6960 232.0246 245.8432 274.2468 317.4116 330.0914 346.5650 386.9031 394.0509 409.2742 444.2170 465.3444 478.4401 511.1774 515.3636 582.2439 590.4115 631.9400 640.3196 675.8981 749.4715 754.4118 756.8901 782.7203 804.9782 826.6785 833.3538 841.2721 873.4999 879.1669 927.2481 929.8844 944.1413 957.9904 975.3985 989.9888 995.4510 1022.2542 1024.4071 1050.6606 1064.9799 1080.1618 1096.5627 1125.8668 1129.8629 1143.0257 1156.9117 1172.1859 1190.3274 1214.9204 1224.4679 1246.4776 1266.2102 1270.5013 1277.7229 1290.1060 1297.9143 1332.2071 1340.9193 1348.4733 1369.6740 1372.1948 1402.5240 1418.8328 1429.7424 1437.0140 1443.2013 1448.5134 1450.3786 1451.7890 1462.4204 1505.7618 1574.6477 1591.0020 1631.7502 2879.5340 2886.8150 2915.3964 2945.3804 2959.2426 3025.8526 3035.2088 3074.0553 3082.2234 3088.0848 3118.4585 3123.4194 3123.7126 3125.9062 3141.4106 3153.0213 3161.0480
redmass: 3.8401 3.3381 5.6242 4.6578 4.9200 6.0041 4.4979 3.7429 2.0327 2.8915 4.4831 2.7468 5.6036 5.0242 1.9165 3.2593 4.1313 6.4100 2.8411 2.5638 6.6616 3.7224 2.4689 4.3018 6.2549 3.3836 5.1415 3.3178 1.3163 4.6890 2.7101 3.8776 1.3605 5.3855 1.6054 1.5523 2.0796 3.9188 1.5682 1.8166 1.3657 1.4003 1.3468 2.6529 2.3234 2.1760 2.0324 2.4400 3.5412 2.1389 2.2049 1.8479 2.4708 1.2299 1.0773 1.0644 1.2038 2.0167 1.4371 1.2465 1.7310 1.3100 1.3757 1.3384 1.2436 1.8206 1.3008 1.2641 1.4344 5.2949 3.0047 3.6096 1.1324 1.0842 1.6131 1.2288 1.1609 1.1123 3.5454 7.3518 5.6665 6.7241 1.0695 1.0686 1.0677 1.0673 1.0668 1.0910 1.0906 1.0941 1.0955 1.0974 1.0857 1.0916 1.0896 1.0882 1.0949 1.0969 1.1004
irintensity: 0.0347 0.0500 0.5841 1.0624 2.2833 2.3783 1.8115 1.9218 3.9485 3.5516 2.4357 8.2772 0.3212 5.0359 0.3094 1.2332 0.4667 6.2625 0.7373 24.3210 0.1580 0.1951 8.2411 10.4795 0.4768 1.1380 40.5007 2.6376 41.7021 0.4739 4.6930 16.1715 59.8504 21.2697 0.1875 23.8320 5.1767 12.9235 8.0202 2.7408 3.5713 5.7305 0.0310 74.2964 4.3946 16.6543 21.7877 11.4565 43.4774 19.2486 73.9937 3.3728 30.5107 2.9824 0.5579 1.7697 6.6636 15.8670 3.6076 20.1249 5.3763 44.9796 36.0709 2.7370 2.1162 1.1581 3.6027 2.3233 1.2160 3.8165 1.8053 4.4023 3.9571 3.3261 13.5476 8.9375 14.7822 12.6547 27.0065 2.8693 36.5069 19.7810 56.9876 116.8458 98.0226 54.6890 73.7658 38.6840 19.5092 11.2819 39.7477 43.2459 6.0085 3.0317 0.4495 9.0849 33.2412 18.0279 36.7266
temp: 298.150 k
press: 1.00000 atm
elementType: 16 8 7 6 6 6 6 6 6 6 6 6 6 6 6 6 6 6 1 1 1 1 1 1 1 1 1 1 1 1 1 1 1 1 1
symmnumber: 1
zpe: 748908.2 jmol-1
zpe.correction: 0.285244 hartree
zpe.thermalcorrener: 0.300291 hartree
zpe.thermalcorrenthalpy: 0.301235 hartree
zpe.thermalcorrgfe: 0.241670 hartree
zpe.sumelectzpe: -1108.492687 hartree
zpe.sumelectthermal: -1108.477640 hartree
zpe.sumelectthermalent: -1108.476696 hartree
zpe.sumelectthermalfe: -1108.536261 hartree
dipole: -0.3838 -0.2471 1.4002
dipole: 1.4727
quadrupole: -110.1013 -112.1070 -114.6148
quadrupole: 5.6855 2.9573 -1.6548
quadrupole: 2.1731 0.1673 -2.3404 5.6855 2.9573 -1.6548
hfenergy: -1108.7779311 hartree
pointgroup: C01 [X(C15H17N1O1S1)]
dipole: -0.0503913 -0.0379047 0.5759602 debye
polarizability: 258.2101687|19.5687161|211.622594|-27.0159939|-18.5674268|115.6856756 unknown
InChI: InChI=1S/C15H17NOS/c1-2-4-14-11-15(6-5-13(14)3-1)18-12-16-7-9-17-10-8-16/h1-6,11H,7-10,12H2
charge 0 multiplicity 1
35 atoms
S  1.188271 2.559071 -0.483806
O  4.188435 -2.107881 -1.012715
N  2.701907 0.191005 -0.081291
C  3.512416 0.263145 -1.321686
C  3.253328 -0.800626 0.881067
C  3.614478 -1.131775 -1.956863
C  3.354394 -2.175161 0.196319
C  2.413207 1.49232 0.516617
C  -0.423008 1.769648 -0.069517
C  -1.851349 -0.17119 0.405601
C  -2.998575 0.704596 0.54249
C  -0.571038 0.388206 0.082777
C  -1.553707 2.642523 0.06495
C  -2.811581 2.115123 0.357051
C  -2.035658 -1.584059 0.580305
C  -4.277602 0.137447 0.854127
C  -3.294725 -2.108994 0.881854
C  -4.425818 -1.241865 1.021686
H  4.539215 0.652668 -1.110743
H  3.015359 0.959502 -2.02275
H  2.577448 -0.870342 1.754936
H  4.265738 -0.501937 1.247738
H  2.60503 -1.469816 -2.27567
H  4.294365 -1.125557 -2.824262
H  3.845146 -2.910642 0.854944
H  2.335005 -2.532153 -0.069661
H  3.300168 2.161856 0.595212
H  1.973479 1.35036 1.517727
H  0.296847 -0.266151 -0.058777
H  -1.415676 3.722688 -0.051972
H  -3.673557 2.785094 0.460308
H  -1.170085 -2.248675 0.471233
H  -5.142159 0.804244 0.958474
H  -3.423432 -3.189236 1.012518
H  -5.407265 -1.666835 1.258982
