program: Gaussian 09
title: 000245743
version: EM64L-G09RevD.01
frameworkgroup: C1[X(C15H23NS)]
method: RPBEPBE
basis: SDD
operation: Freq
keyword: #p
keyword: freq=noraman
keyword: PBEPBE/SDD
title: #p freq=noraman PBEPBE/SDD
converged: YES YES NO NO
title: Mulliken charges:
elementType: S N C C C C C C C C C C C C C C C H H H H H H H H H H H H H H H H H H H H H H H
charge: 0.066711 -0.016298 -0.395848 -0.384765 -0.386579 -0.383835 -0.380434 -0.568290 -0.561519 0.524669 0.527657 0.491321 -0.620755 -0.619049 -0.816921 -0.815937 -0.816437 0.222077 0.182686 0.232880 0.197565 0.196402 0.235513 0.209410 0.209549 0.210041 0.207289 0.265209 0.258963 0.234672 0.234600 0.216055 0.225360 0.248520 0.225485 0.216032 0.249195 0.222375 0.233954 0.222481
chargesum: 0.00000
title: Mulliken charges with hydrogens summed into heavy atoms:
elementType: S N C C C C C C C C C C C C C C C
charge: 0.066711 -0.016298 0.008915 0.045680 0.045336 0.035124 0.036895 -0.044119 -0.561519 0.524669 0.527657 0.491321 -0.386083 -0.384449 -0.126987 -0.125226 -0.137627
polarizability: 2.85952149e+02 -6.17818060e-01 1.81115826e+02 -1.20920913e+00 5.44563535e-03 1.30523280e+02
1716.lowfreq: -32.7389 -15.2993 -0.0014 -0.0008 0.0011 6.0334 8.0158 14.6907 29.8302
frequency: -32.3893 -10.0911 29.5864 38.6615 67.9396 85.1289 111.9024 124.5160 136.6972 175.2603 181.1790 214.9290 224.6502 244.3651 271.3701 287.1711 306.4796 327.5544 377.6182 402.5095 418.5902 421.4168 445.2952 490.0713 507.1138 525.0128 536.7548 557.6245 558.5333 572.6459 609.5573 738.0637 761.4338 801.8081 838.3742 849.0230 849.6949 865.3428 891.3037 892.6902 927.2827 949.7625 953.3256 990.2220 1013.9277 1015.9917 1027.8068 1031.1035 1032.5650 1041.4103 1045.4363 1050.3662 1062.2400 1099.0417 1111.7301 1146.7393 1160.5589 1179.3091 1186.8274 1223.1780 1247.6295 1252.6153 1265.3714 1310.8252 1315.6257 1326.9169 1336.5071 1342.7153 1346.8998 1349.8849 1354.2264 1395.2916 1397.8013 1399.6951 1405.1417 1408.9620 1414.6999 1440.6862 1456.9602 1458.3823 1459.8696 1460.4981 1466.1096 1467.8437 1468.3734 1473.0904 1476.0523 1477.2130 1481.0873 1578.2547 1607.3059 2959.5363 2962.8021 2964.0322 2972.3887 2979.2496 2981.6301 2983.3356 2984.8445 3034.9298 3042.9257 3043.5339 3049.8469 3053.0068 3054.2220 3059.1818 3060.4924 3062.0639 3081.7900 3081.9879 3083.4091 3109.5245 3114.1289 3133.8467
redmass: 1.0154 3.9425 3.6993 4.1431 4.0168 3.0258 3.6660 1.0718 1.0907 3.3333 2.7146 1.9380 2.7323 6.0743 2.5463 2.7573 2.3785 4.4766 5.6417 2.5075 3.5783 1.9054 2.7542 2.9661 3.3475 3.0189 4.7540 2.1806 3.6244 3.4380 5.3429 3.2562 3.2513 1.4899 2.8985 1.4553 1.5784 1.3056 1.5395 1.6324 2.4970 2.9933 1.3279 2.3460 1.7065 1.6004 5.6910 1.6822 2.3504 1.5418 1.5345 1.6382 1.5027 2.5708 2.0134 1.1119 1.2904 1.5141 1.4576 1.2098 1.4460 1.2796 1.3077 1.6629 6.2592 1.2836 1.3693 1.4602 1.4247 1.2294 7.2481 1.2303 1.3430 1.2640 1.9885 2.1901 2.2753 1.1546 1.0518 1.0788 1.0513 1.0829 1.1336 1.0830 1.0886 1.0549 1.1893 1.1094 1.2651 7.0175 5.5358 1.0651 1.0661 1.0643 1.0385 1.0365 1.0365 1.0612 1.0610 1.0961 1.0945 1.0633 1.0969 1.0949 1.1014 1.0964 1.1023 1.0963 1.0999 1.1000 1.1002 1.0909 1.0917 1.1137
irintensity: 0.4945 0.1019 0.1507 0.5346 1.3274 1.1059 0.4391 0.5472 0.7404 8.2185 6.7909 0.0123 0.0039 0.9898 1.1217 1.4289 12.1244 15.4002 6.3853 58.6107 5.0772 0.4745 0.1113 0.2346 134.8425 0.0295 0.4756 22.1122 3.4833 15.9452 2.5385 7.1794 1.7141 0.0333 8.9195 8.9457 4.1378 21.3955 2.0397 2.9955 0.9366 4.8529 8.4893 88.7562 10.5253 2.2274 45.9886 1.6140 4.3442 6.9793 0.1279 35.3951 8.6375 3.4152 60.5030 0.3288 3.3572 148.2458 39.3817 1.9402 0.0092 3.0537 0.0363 15.9348 0.4876 0.4451 5.0477 11.7596 0.6051 7.0685 0.3206 7.0761 23.0791 3.7941 163.2914 2.0153 0.9843 2.8227 8.6604 5.4817 10.5026 16.3941 11.7804 10.6012 19.0694 11.9055 34.5778 34.1566 24.7777 10.9392 7.9871 26.7425 99.8468 68.5790 50.1346 30.5423 19.3879 34.8299 39.4477 64.3150 51.5633 19.1726 27.6124 23.4207 5.0263 17.2196 105.4069 21.6519 3.1021 37.1510 27.7010 34.3836 26.2891 11.0195
temp: 298.150 k
press: 1.00000 atm
elementType: 16 7 6 6 6 6 6 6 6 6 6 6 6 6 6 6 6 1 1 1 1 1 1 1 1 1 1 1 1 1 1 1 1 1 1 1 1 1 1 1
symmnumber: 1
zpe: 906063.2 jmol-1
zpe.correction: 0.345101 hartree
zpe.thermalcorrener: 0.362261 hartree
zpe.thermalcorrenthalpy: 0.363205 hartree
zpe.thermalcorrgfe: 0.299932 hartree
zpe.sumelectzpe: -1036.896609 hartree
zpe.sumelectthermal: -1036.879449 hartree
zpe.sumelectthermalent: -1036.878505 hartree
zpe.sumelectthermalfe: -1036.941778 hartree
dipole: -1.3986 -0.0916 1.5302
dipole: 2.0750
quadrupole: -97.2539 -104.7795 -116.4706
quadrupole: -0.0800 0.1805 0.2012
quadrupole: 8.9141 1.3885 -10.3026 -0.0800 0.1805 0.2012
hfenergy: -1037.24171 hartree
pointgroup: C01 [X(C15H23N1S1)]
dipole: -0.520077 0.0905862 -0.6227289 debye
polarizability: 285.4653734|-0.3735139|180.7478385|8.7886822|4.2647756|131.3780427 unknown
InChI: InChI=1S/C15H23NS/c1-12-9-13(2)15(14(3)10-12)17-11-16-7-5-4-6-8-16/h9-10H,4-8,11H2,1-3H3
charge 0 multiplicity 1
40 atoms
S  -0.621622 -0.202901 0.746988
N  -2.634875 0.058485 -1.414218
C  -4.875615 0.119791 0.504652
C  -4.128371 -1.198527 0.185022
C  -3.933583 1.337049 0.332485
C  -3.500647 -1.130697 -1.23264
C  -3.305939 1.338758 -1.087149
C  -1.246095 -0.063241 -1.227368
C  1.192311 -0.091545 0.433658
C  1.831377 1.18451 0.425112
C  1.947149 -1.280883 0.204694
C  3.997368 0.084033 -0.05779
C  3.224867 1.246914 0.174711
C  3.338162 -1.168479 -0.040631
C  1.059221 2.464927 0.690979
C  1.298201 -2.653764 0.22955
C  5.49604 0.174587 -0.289778
H  -5.281924 0.091813 1.533018
H  -5.74296 0.225144 -0.181342
H  -3.328373 -1.367199 0.931148
H  -4.820768 -2.061331 0.236432
H  -4.48843 2.283136 0.486484
H  -3.124897 1.294715 1.086762
H  -2.902275 -2.035406 -1.441898
H  -4.313369 -1.08141 -1.987357
H  -4.105845 1.506981 -1.838361
H  -2.570592 2.156766 -1.190525
H  -0.689265 0.820938 -1.571407
H  -0.842532 -0.9890 -1.663107
H  3.716519 2.228366 0.165739
H  3.918549 -2.082976 -0.219084
H  1.723036 3.344785 0.626594
H  0.229786 2.600475 -0.027646
H  0.593933 2.446187 1.693121
H  0.503402 -2.744514 -0.533909
H  2.045609 -3.445386 0.046179
H  0.810771 -2.844834 1.202402
H  5.776112 1.131913 -0.764064
H  6.051538 0.107479 0.666318
H  5.856726 -0.645654 -0.935577
