program: Gaussian 09
title: 000245729
version: EM64L-G09RevD.01
frameworkgroup: C1[X(C13H11NOS)]
method: RPBEPBE
basis: SDD
operation: Freq
keyword: #p
keyword: freq=noraman
keyword: PBEPBE/SDD
title: #p freq=noraman PBEPBE/SDD
converged: YES YES NO NO
title: Mulliken charges:
elementType: S O N C C C C C C C C C C C C C H H H H H H H H H H H
charge: -0.030733 -0.266785 -0.465279 0.569928 0.245204 0.139219 -0.509989 -0.328994 -0.339740 -0.347018 -0.182290 -0.217468 -0.248762 -0.224936 -0.242540 -0.226533 0.318246 0.314731 0.275376 0.223208 0.254345 0.231918 0.233945 0.233397 0.231556 0.233697 0.126298
chargesum: 0.00000
title: Mulliken charges with hydrogens summed into heavy atoms:
elementType: S O N C C C C C C C C C C C C C
charge: 0.095565 -0.266785 -0.147033 0.569928 0.245204 0.139219 -0.509989 -0.014263 -0.064364 -0.123809 0.072055 0.014451 -0.014817 0.008461 -0.010984 0.007164
polarizability: 2.66744042e+02 1.03083855e+01 1.77720492e+02 6.21652053e+00 -4.11644955e+00 7.59407148e+01
1716.lowfreq: -4.3643 -0.0014 0.0020 0.0024 2.4082 7.4387 30.1814 42.1273 70.3721
frequency: 30.0549 42.1150 70.3677 90.8930 140.2552 169.8985 199.6319 214.0824 223.2514 288.3001 307.2182 370.0701 400.2190 405.9339 432.3782 440.6664 480.5332 538.9075 578.3047 614.3454 656.7864 683.5934 687.6427 700.7992 718.2264 758.4977 775.5519 793.0876 827.6879 854.8506 858.1230 868.6324 895.3806 937.6876 961.0134 986.5561 989.3227 1003.3215 1007.4963 1014.4585 1025.0752 1040.5695 1083.1669 1096.1711 1128.8291 1171.5704 1173.9855 1195.5596 1240.8777 1249.2568 1300.7841 1323.9464 1366.5845 1385.2026 1425.6977 1434.1920 1449.3656 1481.1463 1512.4123 1571.0440 1584.3644 1600.1202 1609.3543 1611.8754 2392.1923 3118.5188 3132.7715 3136.9462 3146.0738 3151.6324 3159.1187 3170.0775 3170.4818 3192.7676 3421.7129
redmass: 4.3488 5.7464 6.2392 5.1405 4.2655 5.3575 3.3677 4.8023 1.6062 3.4864 7.4865 7.8130 3.5820 4.8434 4.5820 3.2455 5.4427 3.2624 6.6898 6.4300 6.7501 5.1144 6.1068 1.5174 2.5280 1.1329 1.4227 2.5207 4.9932 1.4009 1.3197 3.4001 1.4101 1.4440 1.3644 1.4737 4.7725 1.3227 1.3437 5.8804 2.5663 2.1548 1.7763 2.3541 1.6183 1.0661 1.0597 1.1216 1.6381 3.0915 1.7896 1.3878 6.7669 8.6207 2.5311 2.2943 2.4138 2.2795 2.3496 7.4265 4.4746 6.4522 5.1578 6.1694 1.0387 1.0877 1.0870 1.0863 1.0920 1.0916 1.0957 1.0988 1.1006 1.0952 1.0758
irintensity: 0.3784 2.1717 1.7058 3.7759 1.0133 3.7845 1.7032 3.2763 24.2980 5.3990 5.2923 1.6525 0.5688 0.6642 1.5267 7.8345 0.8642 8.5614 17.3747 0.8297 8.8489 3.8791 2.8135 58.6776 35.3722 0.6877 171.4127 6.0321 0.7583 0.9244 4.3336 14.3438 8.3962 3.0616 4.2615 1.9426 0.4085 3.4802 1.8313 21.9976 5.7282 5.2846 20.1824 4.8017 0.0977 0.2721 2.2202 13.1777 10.2494 102.4908 57.9318 9.9386 177.4314 1.7524 83.6322 28.7739 11.2368 45.6680 544.4571 87.5941 39.2091 50.3197 49.1460 12.6844 23.2241 9.5907 1.4771 3.4074 19.8281 12.4659 15.0305 26.3051 17.1676 11.0130 78.3009
temp: 298.150 k
press: 1.00000 atm
elementType: 16 8 7 6 6 6 6 6 6 6 6 6 6 6 6 6 1 1 1 1 1 1 1 1 1 1 1
symmnumber: 1
zpe: 533950.7 jmol-1
zpe.correction: 0.203371 hartree
zpe.thermalcorrener: 0.217219 hartree
zpe.thermalcorrenthalpy: 0.218163 hartree
zpe.thermalcorrgfe: 0.161314 hartree
zpe.sumelectzpe: -1028.919170 hartree
zpe.sumelectthermal: -1028.905322 hartree
zpe.sumelectthermalent: -1028.904378 hartree
zpe.sumelectthermalfe: -1028.961227 hartree
dipole: 0.3005 2.4718 0.9855
dipole: 2.6779
quadrupole: -79.4270 -100.8006 -103.6356
quadrupole: 5.3564 -0.6539 1.4405
quadrupole: 15.1941 -6.1795 -9.0146 5.3564 -0.6539 1.4405
hfenergy: -1029.1225412 hartree
pointgroup: C01 [X(C13H11N1O1S1)]
dipole: -0.1558375 -0.9329683 0.4640138 debye
polarizability: 267.4481173|7.4901669|177.236435|-1.9132987|-4.0777335|75.7206967 unknown
InChI: InChI=1S/C13H11NOS/c15-13(10-6-2-1-3-7-10)14-11-8-4-5-9-12(11)16/h1-9,14,16H
charge 0 multiplicity 1
27 atoms
S  1.960582 -2.736418 0.460053
O  -0.422783 2.051126 -0.144344
N  0.421662 -0.132511 0.045886
C  1.818061 0.088469 0.023797
C  -2.002455 0.20753 -0.100326
C  -0.613534 0.796518 -0.075394
C  2.681143 -1.035614 0.216133
C  2.403208 1.36814 -0.191597
C  -3.080158 1.0891 0.173084
C  -2.280906 -1.15139 -0.409249
C  4.080466 -0.888406 0.160886
C  3.805751 1.502996 -0.229873
C  4.653375 0.384858 -0.059287
C  -4.409337 0.620326 0.160282
C  -3.613406 -1.618346 -0.426435
C  -4.680283 -0.736713 -0.136128
H  0.169851 -1.121497 0.170974
H  1.742415 2.227023 -0.320854
H  -2.845675 2.137312 0.38495
H  -1.479049 -1.851043 -0.675751
H  4.71369 -1.771359 0.291574
H  4.237888 2.495527 -0.398644
H  5.741656 0.49667 -0.097013
H  -5.23279 1.309051 0.378059
H  -3.819061 -2.665059 -0.67551
H  -5.713096 -1.102068 -0.149781
H  1.855784 -2.678618 1.845306
