program: Gaussian 09
title: 000245755
version: EM64L-G09RevD.01
frameworkgroup: C1[X(C19H22N2O4)]
method: RPBEPBE
basis: SDD
operation: Freq
keyword: #p
keyword: freq=noraman
keyword: PBEPBE/SDD
title: #p freq=noraman PBEPBE/SDD
converged: YES YES NO NO
title: Mulliken charges:
elementType: O O O O N N C C C C C C C C C C C C C C C C C C C H H H H H H H H H H H H H H H H H H H H H H
charge: -0.320468 -0.224953 -0.204363 -0.205422 -0.113715 0.025474 -0.516846 0.402357 -0.300278 -0.294284 0.079439 0.334934 -0.451870 -0.722304 -0.733611 -0.422398 -0.234643 -0.798591 0.189683 0.293193 -0.330966 -0.328572 -0.374522 -0.359126 0.387483 0.279217 0.200395 0.177115 0.224827 0.183637 0.234860 0.238571 0.245708 0.226308 0.215839 0.246512 0.219713 0.218590 0.238948 0.229420 0.237888 0.221443 0.242678 0.280240 0.282283 0.290410 0.289768
chargesum: 0.00000
title: Mulliken charges with hydrogens summed into heavy atoms:
elementType: O O O O N N C C C C C C C C C C C C C C C C C C C
charge: -0.320468 -0.224953 -0.204363 -0.205422 -0.113715 0.025474 -0.037234 0.402357 0.101664 0.124213 0.079439 0.334934 -0.213298 -0.034450 -0.048796 -0.183451 -0.005223 -0.096582 0.189683 0.293193 -0.050726 -0.046289 -0.084112 -0.069358 0.387483
polarizability: 3.85954854e+02 -1.27454568e+01 2.22550870e+02 -4.35026970e+00 -1.98753138e+01 1.84940478e+02
1716.lowfreq: -6.5882 -2.8346 -0.0008 -0.0007 0.0003 6.3744 19.6362 29.0967 40.5383
frequency: 19.4696 29.0499 40.4813 49.7503 62.3965 71.1605 73.4136 78.3758 90.4856 97.7352 105.7702 123.3097 141.2991 163.9511 187.9283 206.4603 222.1709 228.5189 245.6388 253.2062 268.2857 288.9297 297.6916 314.1656 326.4179 352.5106 391.6902 410.4410 441.3951 442.8361 460.6956 486.8590 496.6304 508.4230 524.7534 533.8008 542.7070 603.8601 624.2306 626.6959 672.2010 674.0857 686.1718 735.0789 747.5498 756.7863 778.7357 784.9119 797.4764 797.6529 808.2042 832.8880 864.1803 885.7723 899.1617 912.4795 951.4208 976.5325 987.5237 1001.9086 1003.1591 1005.0672 1011.4189 1026.2215 1037.3183 1047.3746 1069.1837 1080.7166 1087.6240 1090.4345 1097.3798 1109.0984 1127.7361 1150.4633 1162.1511 1174.6457 1177.0665 1192.9531 1212.7184 1234.7092 1241.7555 1271.3397 1280.2857 1284.6493 1289.5249 1292.0632 1363.7551 1365.9832 1368.7423 1370.9533 1384.1416 1390.7302 1398.8928 1401.6879 1406.5874 1413.2245 1434.7723 1454.7259 1458.9318 1462.3865 1466.8500 1472.8740 1473.3493 1476.4910 1477.8497 1482.5232 1490.5376 1495.1971 1588.8969 1594.9228 1608.0966 1611.0204 1629.0155 2839.5202 2849.4288 2859.6412 2984.7305 2990.3941 2995.3778 3024.3239 3042.7543 3045.9458 3063.1281 3082.2338 3085.5797 3093.7672 3093.9538 3103.8231 3122.8108 3134.1688 3160.3623 3160.9725 3175.3221 3186.9783 3193.2268
redmass: 3.9769 5.6958 4.0726 4.2370 4.5932 4.2537 3.7340 2.8222 2.3569 2.2727 1.2877 6.4454 3.1993 4.5541 6.6705 1.7892 2.9910 2.4463 5.2086 1.3631 4.0922 2.6552 4.8021 2.8263 4.0799 2.4464 5.7305 2.9220 3.3128 3.8771 4.0588 5.8079 3.9604 5.5985 3.4776 5.2962 4.2666 6.0494 7.1110 6.1236 5.5123 4.4444 5.7415 4.4069 2.9672 3.8141 7.7741 1.4138 2.3273 1.6976 1.2033 6.0533 1.2433 1.6176 1.4756 1.7780 2.2949 1.3790 1.9648 3.1548 2.2390 1.3383 1.3643 2.7212 2.7475 1.5451 2.6935 2.3311 2.0730 3.3036 1.8535 1.3095 1.9693 3.4502 2.3143 1.2876 1.2921 2.2310 6.2499 1.9505 2.6516 2.0953 1.3741 1.2006 1.1635 1.2607 6.7295 2.4150 1.3189 1.4132 2.4250 1.2295 1.2357 1.2676 11.2849 3.8107 1.9975 1.1134 2.3308 1.0500 1.0917 1.0683 1.5618 1.3079 1.1030 1.2844 1.0523 1.0703 8.2466 6.1333 6.3512 7.7080 10.4264 1.0724 1.0723 1.0708 1.0369 1.0358 1.0365 1.0843 1.0877 1.0869 1.0971 1.0983 1.0975 1.0997 1.0997 1.0995 1.0869 1.0911 1.0991 1.0903 1.0890 1.0955 1.0971
irintensity: 0.2034 0.2466 0.3423 1.2304 0.1740 2.6820 1.6710 0.1424 2.5930 0.5692 0.7811 1.9371 0.2501 0.4856 5.6543 2.1489 0.1256 0.8351 2.7791 0.3237 0.1679 1.1814 4.2011 4.1972 2.9425 5.7580 3.8487 0.0138 0.5407 2.3266 2.6236 3.7935 1.6450 1.1815 2.0766 1.3535 0.5868 3.6594 0.4664 47.1372 3.0634 56.5576 12.0755 7.8850 2.8857 9.4755 39.7034 50.8891 2.2710 13.3404 5.0562 4.4990 0.6602 47.0398 1.5163 1.4977 3.6596 0.4808 4.1166 71.4892 5.8444 2.0277 0.0506 57.6304 84.4070 5.7958 12.6326 20.1885 91.9468 15.5640 36.3443 10.4987 7.9295 134.2422 56.7391 27.9613 14.7803 43.8301 616.3437 42.0905 41.5569 0.7587 8.1832 8.3906 5.3820 1.2868 83.0691 7.0733 2.3680 11.9406 12.2238 11.6607 15.3520 13.4287 0.6432 69.6276 21.7548 30.0142 13.2363 14.6430 4.9704 2.2306 9.9060 4.2293 6.5744 28.8731 11.2031 3.3801 33.6279 2.2653 29.5138 4.5862 97.2648 87.3706 31.0281 334.3821 22.0767 21.9951 25.4853 7.8759 10.0995 7.5941 14.8719 22.8071 57.9758 40.3209 25.3945 29.6039 1.5568 16.9838 33.0437 0.8589 1.2131 0.4126 1.2443
temp: 298.150 k
press: 1.00000 atm
elementType: 8 8 8 8 7 7 6 6 6 6 6 6 6 6 6 6 6 6 6 6 6 6 6 6 6 1 1 1 1 1 1 1 1 1 1 1 1 1 1 1 1 1 1 1 1 1 1
symmnumber: 1
zpe: 984364.9 jmol-1
zpe.correction: 0.374925 hartree
zpe.thermalcorrener: 0.399588 hartree
zpe.thermalcorrenthalpy: 0.400532 hartree
zpe.thermalcorrgfe: 0.318905 hartree
zpe.sumelectzpe: -1145.692275 hartree
zpe.sumelectthermal: -1145.667612 hartree
zpe.sumelectthermalent: -1145.666668 hartree
zpe.sumelectthermalfe: -1145.748294 hartree
dipole: -5.4644 0.9495 1.1858
dipole: 5.6716
quadrupole: -175.7395 -134.9899 -150.5794
quadrupole: 4.4624 -8.1316 -0.9327
quadrupole: -21.9699 18.7797 3.1902 4.4624 -8.1316 -0.9327
hfenergy: -1146.0671995 hartree
pointgroup: C01 [X(C19H22N2O4)]
dipole: -2.1943692 0.3735447 0.1558161 debye
polarizability: 386.0720549|1.6520647|200.3258605|12.7951819|-27.0356394|207.0482856 unknown
InChI: InChI=1S/C19H22N2O4/c1-4-20(5-2)13-16-8-6-7-14(3)18(16)25-19(22)15-9-11-17(12-10-15)21(23)24/h6-12H,4-5,13H2,1-3H3
charge 0 multiplicity 1
47 atoms
O  -1.004099 -0.897797 0.402192
O  -0.532256 -0.734266 -1.890388
O  6.226192 0.218747 -0.086158
O  5.644434 0.088897 2.116143
N  -1.323721 1.937872 -0.365424
N  5.355516 0.079063 0.857332
C  -2.480214 1.329589 -1.078016
C  -3.131177 0.138266 -0.383784
C  -0.736633 3.067972 -1.145519
C  -1.690725 2.356508 1.020089
C  -2.425649 -0.927074 0.233533
C  -3.068864 -2.038669 0.837663
C  -4.546618 0.044448 -0.39728
C  -0.234611 2.688488 -2.550924
C  -0.494056 2.819802 1.870992
C  -4.48178 -2.084198 0.797355
C  -5.22018 -1.05154 0.178742
C  -2.256923 -3.138659 1.492153
C  -0.16113 -0.654346 -0.697255
C  1.251718 -0.446643 -0.253182
C  2.245657 -0.297255 -1.255483
C  1.61836 -0.427376 1.117859
C  3.594459 -0.121468 -0.900448
C  2.964615 -0.257198 1.488194
C  3.932953 -0.103688 0.471048
H  -2.116238 0.981258 -2.062283
H  -3.276577 2.09353 -1.267382
H  -1.477084 3.906459 -1.231164
H  0.11832 3.454875 -0.565037
H  -2.465906 3.165559 0.992066
H  -2.16035 1.486613 1.511512
H  -5.119939 0.853131 -0.866021
H  0.432901 1.811913 -2.50406
H  -1.055069 2.455641 -3.251318
H  0.331692 3.536821 -2.976961
H  0.322219 2.078125 1.824223
H  -0.09315 3.796928 1.549605
H  -0.8075 2.925198 2.925697
H  -4.999326 -2.936087 1.252684
H  -6.314021 -1.097368 0.153081
H  -1.646573 -2.747757 2.326798
H  -2.916226 -3.930225 1.886115
H  -1.552832 -3.598661 0.774959
H  1.939694 -0.332704 -2.305768
H  0.842341 -0.549922 1.87697
H  4.380386 -0.004261 -1.650623
H  3.278472 -0.240942 2.534874
