program: Gaussian 09
title: 000019895
version: EM64L-G09RevD.01
frameworkgroup: C1[X(C4H5N3O2)]
method: RPBEPBE
basis: SDD
operation: Freq
keyword: #pfreq=noraman
keyword: PBEPBE/SDD
title: #p freq=noraman PBEPBE/SDD
converged: NO NO NO NO
title: Mulliken charges:
elementType: O O N N N C C C C H H H H H
charge: -0.213724 -0.222492 -0.075886 -0.025140 0.054501 0.256546 -0.221555 -0.334781 -0.580778 0.308038 0.297489 0.263482 0.263493 0.230806
chargesum: 0.00000
title: Mulliken charges with hydrogens summed into heavy atoms:
elementType: O O N N N C C C C
charge: -0.213724 -0.222492 -0.075886 -0.025140 0.054501 0.256546 0.086483 -0.037291 0.177004
polarizability: 1.04830791e+02 1.63683406e+00 7.80827907e+01 3.94004867e-03 3.56965299e-03 3.31684977e+01
1716.lowfreq: -5.0007 0.0007 0.0009 0.0009 9.5926 11.4416 48.7918 82.8980 156.5889
frequency: 48.5283 82.8532 156.5756 172.9777 269.4791 349.0664 401.1957 523.9432 587.7333 628.8133 681.4797 707.1842 751.5669 832.2230 870.5397 917.8805 981.4340 1047.4300 1102.8946 1126.1146 1167.8680 1217.9257 1253.9085 1340.6618 1355.5875 1417.0524 1420.6822 1454.5238 1457.0072 1496.2771 1518.7633 3014.5298 3111.2271 3131.8060 3251.5911 3257.6674
redmass: 1.0960 6.7501 4.0964 5.8280 4.9073 3.6928 7.8433 6.1909 3.5868 6.3725 5.2606 5.0789 9.1430 1.3761 1.4446 4.2493 5.5336 1.7237 1.9568 1.3273 1.4463 8.3486 2.6263 10.1187 8.4649 2.1602 5.0531 1.6430 1.0404 1.2759 4.7147 1.0332 1.1026 1.1026 1.0986 1.1019
irintensity: 0.1719 0.8897 0.6142 2.0503 10.7984 4.2148 2.5269 3.5650 6.1372 0.0617 1.1873 29.6322 28.0620 9.3413 39.0919 3.6370 20.2166 23.9709 5.7377 2.5602 5.6470 196.1828 67.7951 99.2790 67.3208 7.4641 26.6301 12.9519 18.0291 11.5519 114.7636 24.5251 10.5485 6.9317 6.2252 4.5952
temp: 298.150 k
press: 1.00000 atm
elementType: 8 8 7 7 7 6 6 6 6 1 1 1 1 1
symmnumber: 1
zpe: 257837.1 jmol-1
zpe.correction: 0.098205 hartree
zpe.thermalcorrener: 0.106252 hartree
zpe.thermalcorrenthalpy: 0.107196 hartree
zpe.thermalcorrgfe: 0.064420 hartree
zpe.sumelectzpe: -469.347754 hartree
zpe.sumelectthermal: -469.339708 hartree
zpe.sumelectthermalent: -469.338764 hartree
zpe.sumelectthermalfe: -469.381540 hartree
dipole: -5.8879 -1.5828 -0.0026
dipole: 6.0969
quadrupole: -56.0777 -51.9192 -51.4296
quadrupole: 8.4735 -0.0062 0.0005
quadrupole: -2.9356 1.2230 1.7126 8.4735 -0.0062 0.0005
hfenergy: -469.4459594 hartree
pointgroup: C01 [X(C4H5N3O2)]
dipole: 2.2858127 0.7272037 -0.0010309 debye
dipolederiv: -0.7395673 -0.2022107 -0.0001636 -0.2155329 -0.6424729 -0.0003663 0.0004075 0.0005671 -0.2419679 -0.6294101 0.158413 -0.0000587 0.2467727 -0.7553166 0.0004511 0.0002693 -0.0006114 -0.2489232 -0.6289724 -0.0705328 -0.0000453 0.2033533 -0.0936612 -0.0000974 0.0000096 0.0000769 -0.0871702 -0.5145848 0.0703362 0.0000458 -0.0527825 -0.0410638 0.0000411 0.0000885 -0.0000264 -0.1984757 1.8224924 -0.026944 -0.0000299 -0.1222255 1.1722508 -0.0000393 0.0001241 -0.0000322 0.2323316 -0.932392 0.0276162 0.0001432 -0.0468153 -0.1174849 -0.0000407 -0.0005745 0.0000889 0.0069359 0.7065442 0.1062564 0.000025 0.1074588 -0.1517002 -0.0000037 -0.0001005 0.0000304 -0.0768406 0.2169565 -0.1336474 0.0000025 -0.2406761 0.1953824 -0.0000109 -0.0001732 -0.0000843 -0.0624424 0.4436382 0.0913016 0.0001406 0.1665165 0.171226 0.0000116 0.0000303 -0.0000159 0.1715555 0.1225382 -0.0038054 0.000002 -0.0100758 0.0745893 0.0000264 0.0000265 0.0000075 0.2224283 0.1044582 -0.0290553 0.0000016 -0.0159338 0.0808523 0.0000063 0.0000175 0.0000149 0.1857413 -0.0109903 -0.0263692 -0.0506745 0.0043345 0.0944003 0.0716918 -0.100826 0.0352277 -0.0190802 -0.0109879 -0.0262409 0.050708 0.0045974 0.0942984 -0.0718394 0.1007295 -0.0354132 -0.0187182 0.050277 0.0648825 -0.0000967 -0.0289913 -0.0813 0.0001694 -0.0000285 0.0001701 0.1346259 unknown
polarizability: 104.6272487|2.8429112|78.286333|-0.003774|-0.0037448|33.1684977 unknown
InChI: InChI=1S/C4H5N3O2/c1-6-3-4(2-5-6)7(8)9/h2-3H,1H3
charge 0 multiplicity 1
14 atoms
O  -2.651287 -0.89897 0.000691
O  -2.2951 1.366327 0.000535
N  1.736003 0.241923 0.000051
N  1.577594 -1.152878 0.000272
N  -1.876116 0.138484 -0.000882
C  -0.452804 -0.087445 -0.000413
C  0.539593 0.911623 -0.000312
C  0.229209 -1.341629 0.000049
C  3.093599 0.795625 0.000361
H  0.44601 1.993645 -0.00057
H  -0.196731 -2.341643 0.000124
H  3.634473 0.453499 0.897448
H  3.635379 0.452139 -0.895651
H  3.038776 1.894999 -0.000502
