program: Gaussian 09
title: 000245711
version: EM64L-G09RevD.01
frameworkgroup: C1[X(C12H19NO)]
method: RPBEPBE
basis: SDD
operation: Freq
keyword: #p
keyword: freq=noraman
keyword: PBEPBE/SDD
title: #p freq=noraman PBEPBE/SDD
converged: YES YES NO NO
title: Mulliken charges:
elementType: O N C C C C C C C C C C C C H H H H H H H H H H H H H H H H H H H
charge: -0.431055 -0.096148 -0.471755 0.212965 -0.306505 -0.307513 0.337998 0.169277 -0.697854 -0.673818 -0.450335 -0.855258 -0.428034 -0.206390 0.220702 0.201486 0.163135 0.228371 0.173462 0.201550 0.231211 0.205458 0.207089 0.229708 0.214601 0.197940 0.229687 0.235601 0.228128 0.246621 0.214015 0.223463 0.352198
chargesum: 0.00000
title: Mulliken charges with hydrogens summed into heavy atoms:
elementType: O N C C C C C C C C C C C C
charge: -0.078857 -0.096148 -0.049567 0.212965 0.085001 0.067498 0.337998 0.169277 -0.054097 -0.031569 -0.220648 -0.144907 -0.214020 0.017073
polarizability: 1.67112319e+02 -7.07586119e+00 1.46216523e+02 1.27075559e+01 1.21177684e+01 1.08061025e+02
1716.lowfreq: -16.9202 -2.9854 -0.0006 -0.0002 0.0005 14.2239 27.2345 48.3484 67.2045
frequency: 26.8827 48.2823 67.1061 70.2443 111.5864 142.5650 147.8586 183.6562 200.0244 221.9260 227.8103 272.1615 299.7313 309.6726 331.4399 348.9191 364.1404 431.8108 463.4322 473.5795 503.0146 529.9176 547.5161 571.4981 679.5047 714.8912 755.8432 776.0629 794.9758 810.4246 827.5464 858.6187 876.9120 927.2714 955.3966 977.9698 985.1182 1027.9549 1044.2445 1056.0404 1074.5462 1086.2220 1090.1657 1113.3262 1150.3102 1170.8076 1180.6128 1194.8064 1212.7552 1246.1654 1264.0764 1276.7937 1281.7465 1284.2584 1359.0175 1364.3285 1370.9786 1385.4003 1387.7214 1390.0936 1402.0013 1448.6727 1459.6344 1464.4024 1465.3250 1468.9280 1470.9755 1478.1400 1478.8725 1484.3136 1492.7943 1494.8253 1593.7065 1616.2156 2809.3631 2830.0312 2874.3697 2980.2899 2983.0976 2986.1563 3028.4576 3042.9237 3053.8912 3058.0834 3074.4627 3078.7278 3084.4722 3091.0194 3097.4502 3108.9164 3128.2498 3155.6581 3575.7244
redmass: 2.7566 2.6478 2.8386 3.3070 1.7568 1.0982 2.4280 1.5635 2.7687 1.7730 2.3721 2.5459 2.7843 1.5884 1.4626 2.2320 3.2728 2.8918 2.9521 2.9720 3.8120 5.8441 3.9131 3.7618 3.7786 3.2880 1.6929 2.5129 1.1795 1.1801 3.8295 1.3593 2.3947 2.1322 1.3203 2.2710 1.6083 2.1087 1.5508 2.6772 2.0188 1.8984 1.9054 1.8077 1.5800 1.3309 1.6977 2.2626 2.3665 1.7710 2.3009 1.3059 1.1920 1.3272 1.3117 1.3677 1.4981 1.4453 1.8946 1.4984 1.2804 2.2389 1.0985 1.0730 1.0808 1.0918 1.1690 1.2825 1.0663 1.0999 1.1345 1.4779 6.4658 6.6820 1.0719 1.0722 1.0713 1.0377 1.0357 1.0361 1.0862 1.0861 1.0857 1.0959 1.0982 1.0975 1.0987 1.1002 1.1000 1.0882 1.0893 1.0991 1.0659
irintensity: 0.0223 0.2746 0.4682 0.4442 2.1064 0.0607 0.8896 0.9528 0.4478 3.9403 0.1247 17.1049 4.4967 45.1458 60.7773 3.3504 5.8602 0.8795 2.8156 1.4724 6.4298 1.5440 1.7521 0.9069 8.7834 16.9818 47.0294 25.8156 7.4470 5.1879 5.1036 0.2227 7.8702 19.5926 0.8004 7.7108 12.7159 78.0476 8.8766 39.3640 16.3260 5.1993 11.2448 0.6480 44.6709 17.6861 28.8448 23.9124 13.7175 62.0662 20.6248 4.1808 23.6913 12.9220 6.2228 8.8852 3.0906 12.9981 13.7218 34.3269 10.8137 17.3329 9.1919 5.6409 10.9183 11.7190 10.4712 6.3334 9.5919 17.3582 8.2651 11.3415 38.6675 16.6038 68.9866 148.0988 122.9400 32.7235 35.3109 34.0851 9.1586 12.5493 11.1610 16.1741 37.3742 85.4489 22.2306 39.4879 37.8425 11.9270 17.2745 29.6848 26.3808
temp: 298.150 k
press: 1.00000 atm
elementType: 8 7 6 6 6 6 6 6 6 6 6 6 6 6 1 1 1 1 1 1 1 1 1 1 1 1 1 1 1 1 1 1 1
symmnumber: 1
zpe: 745918.5 jmol-1
zpe.correction: 0.284105 hartree
zpe.thermalcorrener: 0.299807 hartree
zpe.thermalcorrenthalpy: 0.300751 hartree
zpe.thermalcorrgfe: 0.240884 hartree
zpe.sumelectzpe: -597.537651 hartree
zpe.sumelectthermal: -597.521950 hartree
zpe.sumelectthermalent: -597.521005 hartree
zpe.sumelectthermalfe: -597.580873 hartree
dipole: 0.6959 0.1530 0.1100
dipole: 0.7209
quadrupole: -81.9521 -76.8761 -86.7445
quadrupole: 2.6762 3.2272 4.6703
quadrupole: -0.0946 4.9815 -4.8869 2.6762 3.2272 4.6703
hfenergy: -597.8217564 hartree
pointgroup: C01 [X(C12H19N1O1)]
dipole: 0.2703635 -0.0817333 0.0258964 debye
polarizability: 166.6409526|-7.7357668|132.6048921|-13.7975047|-21.5280162|122.1440217 unknown
InChI: InChI=1S/C12H19NO/c1-4-13(5-2)9-11-10(3)7-6-8-12(11)14/h6-8,14H,4-5,9H2,1-3H3
charge 0 multiplicity 1
33 atoms
O  0.032137 -1.454227 1.903744
N  -1.785994 0.215503 -0.115396
C  -0.705544 0.920345 0.638876
C  0.67519 0.324676 0.406114
C  -1.671595 0.408684 -1.582585
C  -3.130227 0.544614 0.427121
C  1.670781 0.950736 -0.400534
C  1.0017 -0.905275 1.042487
C  -2.492667 -0.606324 -2.401285
C  -3.427845 -0.151462 1.770032
C  2.929053 0.317313 -0.584249
C  1.431848 2.30394 -1.056796
C  2.253116 -1.536347 0.854632
C  3.215636 -0.9205 0.028423
H  -0.946006 0.822321 1.711131
H  -0.699442 2.012877 0.401631
H  -1.950331 1.453856 -1.888462
H  -0.606083 0.2727 -1.842886
H  -3.265501 1.65354 0.537193
H  -3.882137 0.210292 -0.309357
H  -2.222555 -1.6341 -2.101853
H  -3.58193 -0.482687 -2.263562
H  -2.279966 -0.48429 -3.479833
H  -3.31843 -1.243529 1.657546
H  -2.739044 0.171279 2.570498
H  -4.45915 0.076715 2.099591
H  3.685654 0.80278 -1.210776
H  1.278063 3.100389 -0.304364
H  2.300414 2.592066 -1.673161
H  0.540095 2.302679 -1.709326
H  2.474944 -2.489466 1.353133
H  4.18812 -1.40072 -0.126269
H  0.353395 -2.310479 2.281144
