program: Gaussian 09
title: 000245677
version: EM64L-G09RevD.01
frameworkgroup: C1[X(C15H23NO)]
method: RPBEPBE
basis: SDD
operation: Freq
keyword: #p
keyword: freq=noraman
keyword: PBEPBE/SDD
title: #p freq=noraman PBEPBE/SDD
converged: YES YES NO NO
title: Mulliken charges:
elementType: O N C C C C C C C C C C C C C C C H H H H H H H H H H H H H H H H H H H H H H H
charge: -0.272061 -0.376813 -0.363977 -0.372624 -0.372568 -0.351410 -0.545126 -0.356214 0.250842 -0.696148 -0.520417 0.487557 -0.368474 -0.444157 -0.226062 -0.217474 -0.241400 0.187221 0.188992 0.194531 0.189737 0.200479 0.240286 0.185973 0.188039 0.229870 0.205535 0.194816 0.196605 0.209878 0.208953 0.215627 0.297389 0.266617 0.224386 0.247736 0.231200 0.226771 0.226473 0.229414
chargesum: 0.00000
title: Mulliken charges with hydrogens summed into heavy atoms:
elementType: O N C C C C C C C C C C C C C C C
charge: -0.272061 -0.079424 0.012235 0.011644 0.068197 0.022601 -0.109721 0.035208 0.250842 -0.061690 -0.029414 0.487557 -0.120738 -0.212958 0.000709 0.008998 -0.011986
polarizability: 2.38400901e+02 -7.77657326e+00 1.47781626e+02 1.79112596e+01 1.05600964e+01 1.30169848e+02
1716.lowfreq: -5.0249 -0.0009 -0.0005 0.0007 5.8938 12.2040 17.2203 21.5109 23.4605
frequency: 16.6655 20.8989 22.6084 40.1336 45.6642 67.2822 68.4708 97.6720 129.1819 138.3509 148.2088 181.5360 207.5994 221.5062 226.6043 279.5984 297.1787 331.4829 403.1437 411.6254 427.8552 465.8992 499.3730 560.7474 603.3443 611.2680 619.5051 701.1031 705.3126 722.6998 732.0770 754.0771 763.9278 808.4839 825.6355 854.5785 876.7746 889.9733 907.7354 917.9041 977.3021 987.6583 989.9958 994.1128 995.7540 1013.6737 1026.2402 1028.7161 1041.5259 1061.3179 1077.5431 1080.3103 1086.8871 1112.8002 1119.4161 1172.1168 1185.4304 1187.1620 1206.4935 1213.1552 1223.3533 1231.5907 1241.0380 1265.8831 1275.9595 1283.4990 1292.7615 1295.7480 1312.7628 1322.6220 1342.6384 1353.2697 1356.9211 1357.6779 1386.5257 1390.0742 1441.2514 1445.6060 1463.0476 1463.4139 1468.9043 1469.5109 1476.1992 1477.1714 1479.1853 1484.0376 1486.8616 1488.6176 1595.2524 1612.8871 1615.7071 2949.2730 2951.5141 2959.4578 2968.9882 2969.3301 2971.6341 2981.2773 2983.5346 2986.7049 2995.9848 3015.1278 3022.7666 3035.2988 3041.1478 3059.6652 3068.2002 3070.3016 3113.7667 3123.9369 3135.7415 3146.6652 3163.6270 3550.4672
redmass: 3.9680 4.3282 4.0097 4.1933 1.9820 3.8759 2.6414 1.9750 2.2708 2.7930 2.2160 4.3573 3.8128 4.3313 1.1364 2.9446 4.7739 2.6121 2.8052 3.2852 2.8828 2.9558 3.7513 1.7271 3.0005 2.5668 4.1046 4.0799 1.8140 1.0632 1.1072 1.7436 1.2271 3.8770 1.2776 1.2487 2.9737 1.8873 1.2833 1.4384 1.3947 2.6074 5.9850 1.4001 1.4267 2.5534 2.4182 2.6700 3.3170 2.4571 2.2070 2.2338 1.5545 1.7995 2.6067 1.0540 1.5471 1.2251 1.5172 2.4348 1.3478 1.2650 1.4305 1.2814 1.2003 1.0886 1.0899 1.1753 1.3339 1.3630 1.4353 1.4832 1.6644 1.6119 5.7051 1.2182 2.1496 1.0998 1.0761 1.0691 1.2360 1.0759 1.0646 1.0528 1.9433 1.0834 1.8710 1.0932 6.0718 6.2764 6.0301 1.0590 1.0589 1.0593 1.0580 1.0590 1.0377 1.0697 1.0614 1.0912 1.0978 1.1016 1.0999 1.1045 1.1005 1.1030 1.1007 1.0992 1.0877 1.0859 1.0912 1.0961 1.1015 1.0778
irintensity: 0.1160 2.6719 0.1326 1.9523 1.2322 2.3667 1.0920 0.1363 0.9013 0.9652 0.9645 2.5506 3.4290 4.4438 0.0141 5.0922 5.9689 6.1703 0.6446 5.1474 1.2932 5.0549 13.7798 54.1115 50.2020 20.7332 5.3504 1.4427 49.1940 13.5512 0.6543 44.9404 8.3446 7.7542 0.4778 0.0491 3.7817 6.4330 0.9662 3.0256 0.1984 3.6295 0.0648 0.1547 0.5519 5.4084 5.0338 11.1344 3.0421 0.8707 2.9063 0.1976 21.2385 12.7285 7.6816 0.1248 10.9523 0.1731 15.9039 2.2333 29.8246 28.3287 78.5468 6.2419 8.0521 3.1724 0.3179 0.2750 1.7781 18.4086 7.7667 8.4584 0.1320 5.0397 4.2315 11.5383 26.8671 9.8575 0.0125 0.5772 77.4881 2.6893 5.1818 8.4632 141.1465 3.0643 63.6127 28.4810 0.5778 134.9303 31.5105 3.8537 3.7039 24.2523 110.0076 6.8311 32.5635 38.1385 47.2639 14.5354 5.1487 3.7163 11.2184 62.7557 13.9072 69.1161 105.4498 55.2577 9.7522 0.9268 13.3042 41.0970 22.8308 15.2952
temp: 298.150 k
press: 1.00000 atm
elementType: 8 7 6 6 6 6 6 6 6 6 6 6 6 6 6 6 6 1 1 1 1 1 1 1 1 1 1 1 1 1 1 1 1 1 1 1 1 1 1 1
symmnumber: 1
zpe: 914100.6 jmol-1
zpe.correction: 0.348163 hartree
zpe.thermalcorrener: 0.367024 hartree
zpe.thermalcorrenthalpy: 0.367968 hartree
zpe.thermalcorrgfe: 0.296586 hartree
zpe.sumelectzpe: -714.076666 hartree
zpe.sumelectthermal: -714.057805 hartree
zpe.sumelectthermalent: -714.056861 hartree
zpe.sumelectthermalfe: -714.128243 hartree
dipole: -0.5918 1.2871 -3.3493
dipole: 3.6366
quadrupole: -95.4439 -102.6280 -108.3603
quadrupole: -1.1222 5.3615 7.1570
quadrupole: 6.7002 -0.4839 -6.2162 -1.1222 5.3615 7.1570
hfenergy: -714.4248287 hartree
pointgroup: C01 [X(C15H23N1O1)]
dipole: 0.2018654 0.0048568 -1.4164191 debye
polarizability: 237.4924282|-0.7912856|152.5999094|-21.9680545|-1.8398235|126.2600381 unknown
InChI: InChI=1S/C15H23NO/c1-2-3-4-5-9-12-15(17)16-13-14-10-7-6-8-11-14/h6-8,10-11,16H,2-5,9,12-13H2,1H3
charge 0 multiplicity 1
40 atoms
O  0.355914 0.380311 1.842066
N  1.380168 0.712886 -0.221144
C  -3.470805 -0.330174 -0.263619
C  -4.801585 0.244175 0.272703
C  -2.229797 0.342449 0.361981
C  -6.050028 -0.425585 -0.344515
C  -0.901295 -0.238096 -0.178438
C  -7.380585 0.143425 0.199174
C  0.31532 0.309952 0.574305
C  -8.623329 -0.527554 -0.42505
C  2.640071 1.227308 0.343469
C  3.856386 0.396626 -0.052643
C  3.866728 -1.007067 0.155909
C  5.001811 1.014113 -0.611933
C  5.000476 -1.774853 -0.186628
C  6.140155 0.247559 -0.954704
C  6.142256 -1.149724 -0.743578
H  -3.442563 -0.216829 -1.368137
H  -3.43662 -1.421686 -0.061867
H  -4.830174 0.127716 1.376102
H  -4.836057 1.336128 0.07531
H  -2.260509 1.4341 0.17038
H  -2.238469 0.215997 1.460828
H  -6.025232 -0.304715 -1.448119
H  -6.014676 -1.518415 -0.151284
H  -0.911822 -1.33766 -0.034166
H  -0.813747 -0.056335 -1.268037
H  -7.413478 1.235845 0.009512
H  -7.405545 0.019138 1.301082
H  -8.628249 -1.615784 -0.224581
H  -8.63847 -0.389747 -1.522913
H  -9.560616 -0.104913 -0.018482
H  1.307307 0.61622 -1.235342
H  2.489953 1.214852 1.440007
H  2.788401 2.281626 0.038604
H  2.985047 -1.49061 0.593092
H  5.005016 2.098972 -0.778267
H  4.998473 -2.857434 -0.015959
H  7.019676 0.738523 -1.386433
H  7.022594 -1.745838 -1.008887
