program: Gaussian 09
title: 000245664
version: EM64L-G09RevD.01
frameworkgroup: C1[X(C8H11Cl2NO2S2)]
method: RPBEPBE
basis: SDD
operation: Freq
keyword: #p
keyword: freq=noraman
keyword: PBEPBE/SDD
title: #p freq=noraman PBEPBE/SDD
converged: YES YES NO NO
title: Mulliken charges:
elementType: Cl Cl S S O O N C C C C C C C C H H H H H H H H H H H
charge: -0.031394 -0.066312 1.008901 0.364064 -0.510535 -0.512490 -0.345076 -0.333838 -0.323498 -0.429940 -0.563913 -0.577607 -0.096074 -0.111093 -0.492348 0.295998 0.237908 0.249950 0.263028 0.275525 0.260031 0.313053 0.285186 0.303996 0.261325 0.275155
chargesum: 0.00000
title: Mulliken charges with hydrogens summed into heavy atoms:
elementType: Cl Cl S S O O N C C C C C C C C
charge: -0.031394 -0.066312 1.008901 0.364064 -0.510535 -0.512490 -0.345076 0.200069 0.189479 -0.429940 -0.028358 0.020632 0.207922 0.150231 -0.217193
polarizability: 1.79707925e+02 -1.32824460e+01 1.48044540e+02 4.46245021e+00 1.19556845e+01 1.38640880e+02
1716.lowfreq: -8.0414 -6.8606 -0.0018 -0.0010 0.0027 5.9529 22.2393 30.1123 39.5309
frequency: 21.8975 30.0691 39.4399 47.1999 66.9067 76.9400 105.0965 129.6488 149.7768 186.2205 202.8992 214.0120 227.9870 246.0905 265.1020 280.3744 308.4227 354.6199 386.0622 430.2471 469.2983 481.5024 555.8420 578.5493 609.0059 621.4524 679.9739 684.6938 711.2270 760.2566 793.7198 815.7184 816.0651 854.0205 907.1509 920.8716 928.4148 936.5400 944.9723 998.1301 1022.1731 1052.4787 1056.1060 1095.7441 1123.9949 1189.4094 1209.0586 1231.3442 1245.3301 1253.6235 1295.9629 1316.2405 1328.4507 1349.5716 1373.2921 1436.8999 1440.1055 1442.9902 1450.1139 1470.6951 1518.9914 2944.2551 2989.0337 3030.1143 3048.2301 3051.0333 3084.4112 3127.6759 3173.3222 3185.1768 3201.9029 3236.0257
redmass: 10.6881 7.2189 9.5492 9.9112 5.7653 9.9964 3.8084 6.9267 3.8334 4.8151 7.9665 3.4035 6.3037 11.5926 6.1585 3.6814 7.9011 2.5130 12.9082 3.8985 8.3843 5.3973 3.1776 5.2544 10.7331 4.1038 7.0998 5.9647 1.1760 1.3061 13.2160 4.6388 2.2093 1.2497 2.1165 4.4466 1.4387 6.5744 2.4301 1.4852 3.7714 1.7921 2.0512 1.0997 1.4081 1.3654 1.4141 2.9403 1.1782 1.1653 1.2089 1.1537 2.2401 1.1958 1.2436 1.1145 1.2990 3.1087 1.0968 1.0926 5.2768 1.0661 1.0596 1.0912 1.1033 1.0604 1.0571 1.1099 1.1117 1.0902 1.0978 1.1012
irintensity: 0.9050 1.5479 0.9954 0.9877 5.1951 0.2651 0.3870 0.3392 2.3256 5.3785 5.4707 5.3463 1.6209 3.1870 5.7357 12.1878 3.3525 10.4318 25.2990 12.2812 90.1654 37.2682 1.2359 97.6082 16.2099 17.4126 16.0660 88.9782 108.1456 29.4887 80.5952 10.0018 31.5174 13.4444 19.0832 46.5508 4.8640 50.0603 24.3034 2.6694 6.5064 1.5161 8.1632 2.2855 15.7608 2.0958 36.0306 47.1075 10.0262 13.1632 14.2301 17.2389 3.4299 1.7114 1.9205 17.5111 19.7655 18.9338 13.3307 16.7810 3.9204 29.7884 10.1043 8.0371 6.0491 21.9133 6.3743 13.8616 4.7218 2.3868 4.9468 0.2279
temp: 298.150 k
press: 1.00000 atm
elementType: 17 17 16 16 8 8 7 6 6 6 6 6 6 6 6 1 1 1 1 1 1 1 1 1 1 1
symmnumber: 1
zpe: 477370.9 jmol-1
zpe.correction: 0.181821 hartree
zpe.thermalcorrener: 0.199182 hartree
zpe.thermalcorrenthalpy: 0.200126 hartree
zpe.thermalcorrgfe: 0.133291 hartree
zpe.sumelectzpe: -2231.518271 hartree
zpe.sumelectthermal: -2231.500910 hartree
zpe.sumelectthermalent: -2231.499966 hartree
zpe.sumelectthermalfe: -2231.566801 hartree
dipole: -3.2072 1.4344 -4.8630
dipole: 5.9994
quadrupole: -101.2616 -133.6238 -116.2837
quadrupole: -11.2733 -7.1497 8.9435
quadrupole: 15.7948 -16.5674 0.7726 -11.2733 -7.1497 8.9435
hfenergy: -2231.7000917 hartree
pointgroup: C01 [X(C8H11Cl2N1O2S2)]
dipole: 1.1609881 -0.0037305 -2.0550574 debye
dipolederiv: -0.290924 0.0305885 0.1022039 -0.0098695 -0.1949553 0.0149162 0.205266 -0.0016512 -0.3892413 -0.2958403 -0.155756 -0.0460193 -0.2533714 -0.5591786 -0.1473296 -0.106605 -0.2011141 -0.2423156 2.4637002 -0.156558 0.1310886 -0.4005282 1.2085003 0.1584353 0.1098584 0.1968644 1.3796479 0.0487458 0.1129342 0.0375731 0.2143981 -0.149428 0.1155375 -0.0048354 0.1557002 0.0666838 -0.7527965 -0.0204977 0.0179222 0.0426831 -0.5650753 0.1593212 -0.0287405 0.0288921 -0.6616135 -0.7294222 -0.0040911 -0.0763381 0.0806639 -0.6577487 -0.1677337 -0.0361354 -0.051045 -0.466322 -1.0131698 -0.0491709 -0.1015655 0.0472111 -0.7747529 -0.0843741 0.0963295 -0.0797268 -0.3153818 0.3294502 -0.2603584 -0.0150515 -0.5102778 0.3947325 -0.1827983 -0.1080943 -0.135154 -0.0618801 0.2354601 0.1670033 -0.0270654 0.3524777 0.3492622 0.2267098 -0.2372777 -0.0453256 0.0254583 -0.4547064 0.1417808 -0.0655807 0.220571 -0.1267401 -0.2725979 -0.1432943 -0.2577384 -0.1071809 0.1529039 0.0891699 -0.1235041 0.1366745 0.1474145 -0.0310263 -0.2461571 0.0249091 0.5571809 0.2235297 0.1026748 0.0992115 0.2102985 0.5814016 0.2295599 0.159173 0.295863 0.1749173 -0.0051357 0.0818269 -0.1197407 -0.231389 -0.1200014 0.1432007 0.1246062 -0.0502117 -0.094376 -0.1569356 -0.1283922 0.0760747 -0.0437631 -0.0829358 0.0117565 0.0528564 0.0676551 -0.1880504 -0.1666733 -0.1709782 -0.0104954 -0.1278384 0.1850914 -0.2151727 -0.0001627 -0.1908902 -0.1220894 0.1035587 -0.0514598 -0.0066077 -0.023776 0.0720804 -0.0263286 0.0282739 -0.0913454 0.1198772 -0.0694359 0.0839741 0.0366746 0.1088082 0.0465681 0.0665982 -0.0154735 0.1252577 -0.1146168 0.0359667 -0.0315719 -0.0840782 -0.0715075 0.038503 0.001185 -0.0618102 0.0590766 -0.0512244 -0.0313984 0.0603537 0.0414782 0.0713051 -0.0279037 -0.0318195 0.059564 0.0309267 0.092751 0.0189771 0.0630519 0.012272 0.0893581 -0.0751785 0.0636548 0.0164792 0.0487303 -0.0019401 0.0214795 -0.0549521 0.0076282 -0.1245623 0.0226115 -0.0625277 -0.0021937 -0.0719714 -0.0853794 0.1071849 0.0311911 -0.0581841 0.0017515 0.0208494 -0.0360697 0.0002535 0.0304632 0.0134792 -0.0541797 0.0205835 0.0017569 0.0620092 -0.0073977 -0.0400905 0.0026201 -0.0284232 0.0620377 0.1568888 -0.0194657 0.0577933 -0.0269656 0.131805 0.0385521 0.056358 0.0404482 0.1217804 0.0677767 0.0807104 0.0275882 0.1093825 0.0298431 0.0418097 0.0183601 0.0542983 0.149229 0.0549955 0.0374089 0.084965 0.0762563 0.112633 0.0266318 0.0607814 0.0455119 0.138569 unknown
polarizability: 175.6848037|-13.7079628|157.628513|-11.8447843|-4.0842115|133.0800285 unknown
InChI: InChI=1S/C8H11Cl2NO2S2/c9-3-5-11(6-4-10)15(12,13)8-2-1-7-14-8/h1-2,7H,3-6H2
charge 0 multiplicity 1
26 atoms
Cl -3.326553 1.660712 1.139347
Cl -2.713921 -2.970202 -1.389241
S  0.337465 0.530672 0.80037
S  2.841052 0.619954 -1.173714
O  -0.185521 -0.576687 1.879189
O  0.608319 2.075169 1.22826
N  -0.714209 0.628152 -0.719191
C  -1.41288 1.900014 -0.937824
C  -1.165785 -0.665513 -1.261416
C  1.872111 -0.212926 0.083238
C  -2.924056 1.956015 -0.677145
C  -2.232034 -1.41044 -0.427128
C  2.424724 -1.406252 0.510809
C  3.657978 -1.701493 -0.175921
C  4.020324 -0.732076 -1.09994
H  -0.897794 2.660824 -0.320047
H  -1.257855 2.185073 -2.002053
H  -1.558461 -0.463173 -2.276736
H  -0.287636 -1.327393 -1.387912
H  -3.306702 2.962379 -0.90937
H  -3.492305 1.20085 -1.241934
H  -1.838592 -1.750423 0.540118
H  -3.16141 -0.8449 -0.284055
H  1.96605 -2.027141 1.283306
H  4.250614 -2.599179 0.012026
H  4.892576 -0.696818 -1.751038
