program: Gaussian 09
title: 000245662
version: EM64L-G09RevD.01
frameworkgroup: C1[X(C10H12Cl2N2O4S)]
method: RPBEPBE
basis: SDD
operation: Freq
keyword: #p
keyword: freq=noraman
keyword: PBEPBE/SDD
title: #p freq=noraman PBEPBE/SDD
converged: NO YES NO NO
title: Mulliken charges:
elementType: Cl Cl S O O O O N N C C C C C C C C C C H H H H H H H H H H H H
charge: -0.026431 -0.058236 0.977073 -0.504549 -0.515485 -0.193231 -0.191376 -0.351005 0.028102 -0.331508 -0.328586 -0.049030 -0.565608 -0.579398 -0.194978 -0.217863 -0.332217 -0.335464 0.395069 0.292041 0.239976 0.256418 0.258597 0.278467 0.260786 0.313337 0.286486 0.284829 0.303455 0.299409 0.300920
chargesum: 0.00000
title: Mulliken charges with hydrogens summed into heavy atoms:
elementType: Cl Cl S O O O O N N C C C C C C C C C C
charge: -0.026431 -0.058236 0.977073 -0.504549 -0.515485 -0.193231 -0.191376 -0.351005 0.028102 0.200509 0.186429 -0.049030 -0.026354 0.020426 0.089852 0.085592 -0.032808 -0.034545 0.395069
polarizability: 2.46498520e+02 -1.16770707e+01 1.73684389e+02 8.94252050e+00 2.01430586e+01 1.41386551e+02
1716.lowfreq: -9.2982 -0.0020 -0.0016 -0.0005 2.4229 4.4785 18.7318 25.5299 29.7810
frequency: 18.5954 25.3177 29.6591 46.7871 53.0736 67.2164 69.6191 103.4129 114.8660 123.6013 153.0400 187.6285 202.5796 210.9207 221.3169 234.4798 248.7023 273.3097 292.2389 338.2783 360.7234 372.2092 411.5842 414.8642 443.0873 489.9557 498.5715 505.7131 582.1853 612.6556 622.8824 662.2800 680.2091 688.0102 735.5828 763.2108 780.3225 799.9067 814.8932 850.0051 875.2428 906.2409 936.7179 944.4037 990.1292 992.9908 999.6169 1003.2977 1019.8907 1045.5964 1055.1133 1085.5075 1104.8604 1122.2605 1170.0615 1189.5201 1214.6807 1227.3874 1246.9190 1254.9061 1280.7512 1296.2835 1317.0748 1351.3686 1370.5169 1372.7748 1391.4099 1422.4681 1434.4933 1442.1789 1451.0171 1452.3809 1471.2729 1580.4047 1606.5763 2949.9520 2990.0586 3032.8552 3048.2833 3050.7869 3086.3313 3127.0956 3161.7313 3164.5720 3174.5820 3188.4758 3190.5648
redmass: 11.0407 11.1728 7.2435 9.9152 7.4001 8.1157 6.6754 9.3974 3.7678 8.9585 3.0662 5.9540 9.8029 6.2656 5.3075 8.4660 5.1415 5.1936 4.6306 4.5705 2.9435 13.4637 2.9444 7.8236 3.5997 7.2636 4.3213 7.2050 5.1919 7.1041 4.0162 4.9232 8.6784 5.9522 4.2364 1.3072 10.0611 13.3151 2.1615 1.2936 1.4695 2.1306 5.0471 2.7694 1.3592 5.4630 1.5185 1.3711 3.7184 2.3162 2.0663 4.0524 1.2814 1.4471 1.2370 1.3641 8.4982 2.7726 1.1829 1.1582 1.2458 1.2032 1.1500 1.1882 5.9916 1.2466 5.9154 6.9589 1.0754 1.0846 2.1612 1.0820 1.0923 6.2051 8.4374 1.0654 1.0595 1.0910 1.1030 1.0617 1.0570 1.1100 1.0908 1.0906 1.1116 1.0951 1.0964
irintensity: 0.5396 1.0230 0.8654 0.3779 2.7430 1.3413 1.7379 4.4998 0.3382 6.0057 2.6116 3.8735 6.1220 6.6412 0.7349 1.4766 3.7562 11.9845 6.1520 4.7044 6.7464 42.8941 0.9108 30.1414 2.8533 31.3276 47.9979 0.7758 97.9959 0.0176 15.4150 21.4142 28.2820 109.3756 6.5563 31.3632 56.8157 47.9027 27.7563 8.3127 44.3890 24.9818 55.0992 31.9331 3.0533 6.6441 2.0560 0.9796 6.2302 25.4131 5.2668 6.6617 11.7422 17.7984 14.3147 3.4176 287.4554 39.6795 7.9891 9.4862 0.2215 12.9850 17.7188 2.2710 46.9425 3.1535 63.5498 48.7480 23.8691 8.1426 10.9200 14.9641 16.6886 29.5445 0.5667 28.5625 10.0339 7.7827 6.8392 20.8953 6.2942 12.6900 4.3797 2.9581 4.8505 3.7917 1.7074
temp: 298.150 k
press: 1.00000 atm
elementType: 17 17 16 8 8 8 8 7 7 6 6 6 6 6 6 6 6 6 6 1 1 1 1 1 1 1 1 1 1 1 1
symmnumber: 1
zpe: 567598.7 jmol-1
zpe.correction: 0.216187 hartree
zpe.thermalcorrener: 0.236464 hartree
zpe.thermalcorrenthalpy: 0.237408 hartree
zpe.thermalcorrgfe: 0.163361 hartree
zpe.sumelectzpe: -2115.134652 hartree
zpe.sumelectthermal: -2115.114375 hartree
zpe.sumelectthermalent: -2115.113431 hartree
zpe.sumelectthermalfe: -2115.187478 hartree
dipole: 1.7033 -0.6605 -4.4892
dipole: 4.8467
quadrupole: -162.3157 -145.6607 -130.9630
quadrupole: 2.1886 -17.0182 9.4828
quadrupole: -16.0026 0.6525 15.3501 2.1886 -17.0182 9.4828
hfenergy: -2115.3508389 hartree
pointgroup: C01 [X(C10H12Cl2N2O4S1)]
dipole: -0.5052734 -0.8665187 1.6216768 debye
polarizability: 245.5480217|13.5521751|184.5835661|6.4716498|-5.9223977|131.4378724 unknown
InChI: InChI=1S/C10H12Cl2N2O4S/c11-5-7-13(8-6-12)19(17,18)10-3-1-9(2-4-10)14(15)16/h1-4H,5-8H2
charge 0 multiplicity 1
31 atoms
Cl -4.833516 -1.289403 -0.560706
Cl -3.14509 3.273697 1.562413
S  -1.094271 -0.682714 -0.9973
O  -1.659556 0.492857 -1.975805
O  -1.142309 -2.259194 -1.395376
O  5.523372 -0.127207 0.589671
O  5.142289 1.980679 -0.197878
N  -1.806952 -0.584929 0.706591
N  4.759983 0.783456 0.088963
C  -2.609179 -1.739562 1.134593
C  -1.978934 0.775028 1.253008
C  0.71181 -0.226264 -0.641952
C  -4.137268 -1.591062 1.161583
C  -3.090193 1.637444 0.611155
C  1.554584 -1.219604 -0.114413
C  1.135006 1.073601 -0.964333
C  2.901896 -0.883489 0.127046
C  2.48342 1.410539 -0.720025
C  3.335305 0.427359 -0.173527
H  -2.330004 -2.588154 0.480774
H  -2.289829 -1.999284 2.167656
H  -2.180195 0.653797 2.335265
H  -1.019274 1.320874 1.173842
H  -4.597279 -2.527994 1.513414
H  -4.48182 -0.750169 1.782961
H  -2.868719 1.892683 -0.433511
H  -4.095183 1.205267 0.694404
H  1.174367 -2.226657 0.081686
H  0.436042 1.784816 -1.415727
H  3.612032 -1.607078 0.534872
H  2.878263 2.404064 -0.946342
