program: Gaussian 09
title: 000245660
version: EM64L-G09RevD.01
frameworkgroup: C1[X(C11H15Cl2NO3S)]
method: RPBEPBE
basis: SDD
operation: Freq
keyword: #p
keyword: freq=noraman
keyword: PBEPBE/SDD
title: #p freq=noraman PBEPBE/SDD
converged: NO YES NO NO
title: Mulliken charges:
elementType: Cl Cl S O O O N C C C C C C C C C C C H H H H H H H H H H H H H H H
charge: -0.034281 -0.073513 0.974454 -0.518760 -0.528384 -0.257138 -0.356480 -0.322991 -0.326509 -0.064776 -0.563936 -0.574989 -0.252022 -0.203535 -0.330574 -0.326729 0.340948 -0.537628 0.292434 0.230412 0.249427 0.259211 0.273071 0.258166 0.312622 0.283807 0.292002 0.274319 0.256012 0.265222 0.227580 0.229323 0.253231
chargesum: 0.00000
title: Mulliken charges with hydrogens summed into heavy atoms:
elementType: Cl Cl S O O O N C C C C C C C C C C C
charge: -0.034281 -0.073513 0.974454 -0.518760 -0.528384 -0.257138 -0.356480 0.199855 0.182130 -0.064776 -0.032698 0.021441 0.039980 0.070784 -0.074561 -0.061507 0.340948 0.172506
polarizability: 2.37795424e+02 -1.58921663e+01 1.68999440e+02 5.51369492e+00 1.43283363e+01 1.42980575e+02
1716.lowfreq: -10.3588 -5.3807 -0.0033 -0.0024 -0.0003 4.6953 18.0656 22.2302 31.3722
frequency: 17.5392 22.0261 31.2701 41.6498 53.2344 66.2954 93.9602 107.4219 125.1425 137.0631 159.2705 187.7004 205.2767 214.5239 231.2763 233.8912 246.4167 263.6166 278.9971 319.0475 335.4555 364.6755 388.6126 416.4287 443.3913 452.0657 480.2242 518.3665 570.5065 595.0437 617.5444 623.1871 680.1104 716.9768 758.9101 762.8789 797.1562 816.6794 819.1040 836.0657 907.7091 933.6010 946.1934 954.3380 966.6655 979.0740 984.9255 996.9185 1022.5361 1048.8951 1055.9386 1109.4389 1112.7862 1127.0221 1155.8578 1170.8802 1190.5918 1234.3892 1236.6436 1247.4194 1251.4243 1287.3118 1296.1508 1317.8304 1349.6545 1374.6052 1387.2480 1411.3369 1435.2761 1437.0716 1441.4816 1452.0055 1468.1691 1469.7548 1470.7322 1475.4216 1585.8211 1599.3990 2935.2688 2969.6115 2985.6210 3028.2863 3043.4940 3048.3123 3062.2568 3082.4589 3124.8510 3135.8585 3153.9498 3157.9185 3171.5718 3176.1206 3179.8458
redmass: 7.7191 5.3589 6.5994 6.2654 6.4251 9.0741 4.7326 3.8983 5.4700 3.8525 3.5228 5.3078 4.7367 4.1287 4.1257 1.9230 2.9198 4.0480 4.1105 4.4715 3.9069 3.5679 7.6320 2.9725 5.3811 4.1699 5.1680 2.7901 4.9595 6.5045 6.7386 4.1326 5.8105 3.3953 5.1510 1.3127 13.5508 1.7171 1.4678 1.6610 2.1564 10.0197 2.1370 1.3496 1.3592 8.5839 4.3984 1.4822 3.9323 2.4704 2.0674 1.3002 1.2588 1.3740 1.3179 1.1823 1.3639 3.4622 3.0309 1.2036 1.1734 1.2648 1.2309 1.1590 1.1959 1.2454 5.3604 4.5245 1.2021 1.0732 1.0850 1.0797 1.3904 1.0996 1.0632 1.4393 6.9148 6.7578 1.0668 1.0327 1.0595 1.0900 1.1033 1.0603 1.1045 1.0570 1.1099 1.1001 1.0892 1.0889 1.1120 1.0947 1.0972
irintensity: 1.0653 1.1185 1.7825 1.9474 1.2115 2.0140 1.0015 1.1423 2.6638 2.9023 8.6544 2.0071 9.6442 5.5904 0.1439 4.3751 1.8601 0.7336 17.6793 1.0597 5.4102 16.7413 26.6545 0.4229 42.9626 9.8940 76.3430 35.1837 56.6799 68.5968 2.9661 23.5908 108.6986 0.6319 18.5512 22.5050 95.4151 14.6798 11.9671 76.7121 27.3713 72.3613 18.4128 0.1919 0.7844 42.2356 5.0435 2.1652 6.9508 38.9167 6.5602 10.5647 0.1677 15.2438 6.3929 77.5411 1.8355 263.9901 24.8756 5.6077 8.9261 2.9501 19.8668 17.8922 2.2597 1.0504 11.6347 6.6305 22.1204 25.0434 6.4348 16.2028 137.4483 6.4146 18.5606 6.1524 56.1512 74.4030 40.6316 55.8123 12.4501 9.8310 7.9697 23.3605 39.0972 7.8975 15.3291 20.0112 1.9137 0.1258 4.6539 6.7461 6.1788
temp: 298.150 k
press: 1.00000 atm
elementType: 17 17 16 8 8 8 7 6 6 6 6 6 6 6 6 6 6 6 1 1 1 1 1 1 1 1 1 1 1 1 1 1 1
symmnumber: 1
zpe: 647041.8 jmol-1
zpe.correction: 0.246445 hartree
zpe.thermalcorrener: 0.266782 hartree
zpe.thermalcorrenthalpy: 0.267726 hartree
zpe.thermalcorrgfe: 0.193904 hartree
zpe.sumelectzpe: -2025.191873 hartree
zpe.sumelectthermal: -2025.171536 hartree
zpe.sumelectthermalent: -2025.170592 hartree
zpe.sumelectthermalfe: -2025.244414 hartree
dipole: -4.9392 1.6478 -4.3844
dipole: 6.8069
quadrupole: -105.4276 -142.9849 -128.4717
quadrupole: -11.0385 -17.0816 10.3141
quadrupole: 20.2005 -17.3569 -2.8436 -11.0385 -17.0816 10.3141
hfenergy: -2025.4383184 hartree
pointgroup: C01 [X(C11H15Cl2N1O3S1)]
dipole: 1.9418323 -0.2415091 -1.8283445 debye
polarizability: 235.1250271|-18.5966724|177.7931232|-9.8655696|-2.9174734|136.8572888 unknown
InChI: InChI=1S/C11H15Cl2NO3S/c1-17-10-2-4-11(5-3-10)18(15,16)14(8-6-12)9-7-13/h2-5H,6-9H2,1H3
charge 0 multiplicity 1
33 atoms
Cl -4.645547 1.078307 0.748654
Cl -2.750004 -3.4022 -1.42481
S  -0.764224 0.729426 0.908066
O  -1.208283 -0.433313 1.963985
O  -0.870563 2.314252 1.27012
O  4.973154 -0.395339 -0.637323
N  -1.66121 0.556654 -0.695528
C  -2.55034 1.656347 -1.0753
C  -1.759639 -0.808649 -1.233758
C  1.00302 0.337631 0.40995
C  -4.065172 1.412832 -1.011875
C  -2.751411 -1.74319 -0.504618
C  1.538391 -0.901738 0.788628
C  1.743702 1.320776 -0.276117
C  2.87915 -1.189711 0.449588
C  3.076444 1.032434 -0.610723
C  3.644452 -0.222257 -0.253271
C  5.635429 -1.657586 -0.281951
H  -2.284419 2.521191 -0.437174
H  -2.317713 1.939723 -2.126449
H  -2.047269 -0.715293 -2.299154
H  -0.756905 -1.278171 -1.220874
H  -4.603854 2.315532 -1.341129
H  -4.389672 0.546204 -1.608637
H  -2.437118 -1.957598 0.52547
H  -3.790859 -1.391334 -0.523579
H  0.928109 -1.612913 1.354814
H  1.295646 2.28865 -0.521086
H  3.308818 -2.152129 0.739747
H  3.700923 1.758178 -1.139058
H  5.129555 -2.520859 -0.754818
H  5.668765 -1.794597 0.81563
H  6.656945 -1.563164 -0.67642
