program: Gaussian 09
title: 000020090
version: EM64L-G09RevD.01
frameworkgroup: C1[X(C21H23ClN4O)]
method: RPBEPBE
basis: SDD
operation: Freq
keyword: #p
keyword: freq=noraman
keyword: PBEPBE/SDD
title: #p freq=noraman PBEPBE/SDD
converged: YES YES NO NO
title: Mulliken charges:
elementType: Cl O N N N N C C C C C C C C C C C C C C C C C C C C C H H H H H H H H H H H H H H H H H H H H H H H
charge: -0.046132 -0.232915 -0.090395 -0.296594 -0.231679 -0.033087 -0.318468 -0.332805 -0.343617 -0.420292 -0.415365 -0.405483 0.306486 0.158283 0.211688 -0.611026 -0.019198 -0.355396 -0.330610 0.318165 -0.235160 -0.142081 -0.367534 -0.379815 -0.236254 -0.229001 -0.237647 0.197646 0.189588 0.213113 0.190536 0.189866 0.251241 0.189063 0.206227 0.208150 0.190885 0.261995 0.219457 0.268269 0.237142 0.269933 0.252514 0.297604 0.261989 0.253609 0.274875 0.230048 0.230252 0.231932
chargesum: 0.00000
title: Mulliken charges with hydrogens summed into heavy atoms:
elementType: Cl O N N N N C C C C C C C C C C C C C C C C C C C C C
charge: -0.046132 -0.232915 -0.090395 -0.028325 -0.231679 -0.033087 0.068767 0.070844 0.097490 -0.025002 -0.016330 0.075969 0.306486 0.158283 0.211688 -0.103952 -0.019198 -0.102883 -0.033006 0.318165 0.026829 -0.142081 -0.113925 -0.104939 -0.006205 0.001251 -0.005715
polarizability: 2.86634420e+02 -1.27090419e+01 2.82680773e+02 -4.17792255e+01 -1.58746826e+01 2.53050594e+02
1716.lowfreq: -4.5135 -2.0929 -0.0016 -0.0009 0.0003 5.5220 16.3205 24.8277 33.6350
frequency: 16.2729 24.2160 33.1261 47.6725 55.5864 63.0194 72.9103 81.7168 102.8467 113.0879 127.1710 171.0248 198.9445 208.1719 237.1479 257.2910 268.5048 280.3555 288.9292 313.1811 322.7118 329.0851 364.2797 378.9683 388.9145 405.8458 410.3692 428.8777 439.2831 454.3796 464.1936 479.5230 493.1924 516.0733 538.2631 559.1327 572.0750 615.3268 642.7084 651.1776 673.1096 684.8972 690.6369 701.0468 721.9971 753.6677 762.7326 780.1957 787.0129 788.9553 822.5579 847.7092 859.7204 884.1205 897.6677 904.9256 922.7075 929.1235 940.0753 951.7997 970.2516 984.6312 987.9471 989.8522 1003.0710 1011.5060 1027.2354 1041.5632 1051.5890 1059.5522 1062.7715 1069.5519 1084.5310 1089.8270 1100.8721 1130.0942 1138.9084 1144.1017 1158.7380 1166.4639 1173.4028 1185.6627 1188.9082 1195.9661 1205.0190 1246.5166 1259.5520 1271.2595 1275.8176 1294.1120 1295.5852 1304.5640 1310.3491 1317.5030 1318.4785 1319.4223 1340.0024 1342.9810 1364.7742 1370.4724 1382.3280 1382.9909 1388.6313 1391.4346 1434.3442 1445.4730 1449.0256 1453.2065 1456.7011 1461.8240 1463.4217 1464.6071 1469.5574 1478.2312 1481.2287 1539.7627 1566.5206 1587.2317 1591.3227 1609.4969 1615.5999 2864.1223 2869.8698 2878.9816 2880.7077 2890.8233 2946.2580 3025.9824 3037.1755 3039.8489 3043.4582 3048.1209 3056.3970 3109.9203 3118.3833 3127.3549 3136.5730 3148.7247 3151.7246 3160.5753 3167.7762 3171.0368 3175.9782 3461.0550
redmass: 5.6014 6.8216 2.8783 4.9200 4.0405 5.3724 5.7211 5.9382 3.3512 7.3421 5.5127 5.6815 4.8537 3.5321 5.9957 2.0423 3.2227 5.0272 3.9160 2.7322 4.3289 6.0029 3.2430 4.2724 2.8459 2.8692 3.0204 4.5236 4.1552 4.8468 2.8803 3.6314 3.3745 4.4075 2.9102 2.2530 4.6468 6.4245 5.6294 4.9145 6.7164 1.7516 4.6016 1.8443 3.6550 3.9131 1.9654 2.5695 2.2226 3.7213 1.4884 1.4962 1.2493 2.7376 1.6784 2.2348 2.5260 3.4429 1.4816 1.3412 3.7072 4.1929 1.3917 6.0022 1.3363 2.5657 2.2335 3.6311 1.7786 2.7063 1.9377 2.3705 1.5925 2.1139 2.3057 2.3216 2.0918 2.5112 1.7265 2.8852 1.0586 1.3699 1.1283 1.1266 1.2734 1.8074 2.2083 1.4112 1.6211 2.1921 1.6863 1.3151 1.3285 1.2812 1.3514 1.2930 1.6524 1.4034 1.4752 8.0966 7.8380 1.3989 3.6613 1.4345 2.2647 1.3499 1.1086 1.0919 1.0766 1.4577 1.1065 1.6063 1.1073 1.0942 2.3769 7.2560 7.9892 6.5536 6.9609 6.1509 8.3970 1.0706 1.0700 1.0700 1.0697 1.0681 1.0682 1.0900 1.0890 1.0929 1.0893 1.0628 1.0844 1.0937 1.1059 1.0849 1.0883 1.0933 1.0885 1.0964 1.0923 1.0998 1.0969 1.0753
irintensity: 0.1867 0.1123 0.0124 0.5485 0.0648 1.0223 1.5261 0.7474 1.8175 1.7786 0.9064 0.6450 0.2154 4.4518 0.8297 1.3064 0.1632 1.5325 5.0622 9.8383 1.1136 1.7506 6.4039 13.4552 1.2752 0.0080 0.9895 5.4853 10.5280 3.5316 1.0718 39.1735 9.4659 9.1415 8.9485 55.1027 19.1102 0.0189 3.4225 8.3631 0.8264 72.1248 6.5466 43.5160 29.4915 4.7560 19.6853 19.0222 35.4836 30.4511 30.8302 0.1513 2.5287 3.6282 15.7943 1.4472 15.1059 7.6426 4.2605 1.0430 2.8405 11.3705 2.2228 1.2573 1.3620 23.8319 5.8945 21.3742 2.6937 3.9293 13.1961 15.9851 14.1282 14.4440 4.5164 19.0756 64.6087 60.6109 6.7047 5.0700 0.3263 37.5297 7.1565 2.3351 19.8404 39.9679 51.4883 10.1728 28.0865 46.5489 26.5764 7.1833 10.3798 7.5505 24.7718 22.3319 14.8740 3.9343 14.8900 11.6271 2.8638 1.3113 44.9843 6.5813 13.8317 2.0560 13.2740 1.4037 1.1216 137.5806 2.2223 49.6185 5.5395 12.5593 4.2828 34.6498 12.1343 2.1247 28.7091 12.3783 340.9086 56.3736 66.8426 19.2792 28.6571 265.4489 33.6924 45.5822 59.8331 47.4526 20.1675 15.4374 16.0834 13.5367 8.4986 1.0275 5.6786 29.5695 4.9686 17.2693 0.2640 18.9121 3.1741 1.7857
temp: 298.150 k
press: 1.00000 atm
elementType: 17 8 7 7 7 7 6 6 6 6 6 6 6 6 6 6 6 6 6 6 6 6 6 6 6 6 6 1 1 1 1 1 1 1 1 1 1 1 1 1 1 1 1 1 1 1 1 1 1 1
symmnumber: 1
zpe: 1059875.9 jmol-1
zpe.correction: 0.403685 hartree
zpe.thermalcorrener: 0.427407 hartree
zpe.thermalcorrenthalpy: 0.428351 hartree
zpe.thermalcorrgfe: 0.348205 hartree
zpe.sumelectzpe: -1566.337921 hartree
zpe.sumelectthermal: -1566.314199 hartree
zpe.sumelectthermalent: -1566.313255 hartree
zpe.sumelectthermalfe: -1566.393402 hartree
dipole: -0.7004 2.0912 -2.5758
dipole: 3.3909
quadrupole: -155.6096 -160.0035 -173.3150
quadrupole: -13.3498 5.9950 8.5062
quadrupole: 7.3664 2.9726 -10.3390 -13.3498 5.9950 8.5062
hfenergy: -1566.7416061 hartree
pointgroup: C01 [X(C21H23Cl1N4O1)]
dipole: -0.5257769 1.1407584 -0.4494386 debye
polarizability: 289.3052764|10.8199714|294.0381721|-38.0228755|-1.8817028|239.022338 unknown
InChI: InChI=1S/C21H23ClN4O/c22-17-6-7-19-18(14-17)21(16-4-2-1-3-5-16)24-15-20(27)26(19)13-12-25-10-8-23-9-11-25/h1-7,14,23H,8-13,15H2
charge 0 multiplicity 1
50 atoms
Cl 2.587667 4.78234 1.253463
O  -0.93627 -2.559944 2.361211
N  -3.711293 -0.759829 -0.528966
N  -6.005394 -0.422927 -2.211331
N  -0.66203 -0.337266 1.702328
N  2.068775 -1.569621 1.211631
C  -4.029266 0.55865 -1.133226
C  -4.193746 -1.870226 -1.390822
C  -2.300628 -0.891493 -0.112026
C  -5.548029 0.69035 -1.352274
C  -5.712816 -1.742639 -1.608535
C  -2.100438 -0.301007 1.307129
C  0.147533 0.842289 1.598438
C  -0.179414 -1.562884 2.203962
C  1.451038 0.825006 1.001695
C  1.328245 -1.595545 2.494077
C  2.098692 -0.44094 0.527201
C  -0.380724 2.075809 2.071426
C  2.179942 2.04401 0.905671
C  2.85808 -0.440178 -0.762673
C  0.344748 3.275531 1.967856
C  1.627027 3.239494 1.382086
C  2.551863 0.471801 -1.809222
C  3.879536 -1.406904 -0.971443
C  3.255387 0.421251 -3.032748
C  4.584068 -1.452099 -2.190424
C  4.276349 -0.536857 -3.226641
H  -3.512801 0.687432 -2.117637
H  -3.684626 1.364523 -0.458278
H  -3.969518 -2.829226 -0.889401
H  -3.690156 -1.866408 -2.38918
H  -1.595973 -0.394962 -0.82408
H  -2.033193 -1.962057 -0.076294
H  -6.042499 0.695958 -0.349437
H  -5.766896 1.65015 -1.855717
H  -6.054665 -2.538531 -2.295298
H  -6.216186 -1.887547 -0.621079
H  -2.683117 -0.901033 2.024099
H  -2.459309 0.739435 1.336957
H  -6.985674 -0.32557 -2.503223
H  1.597122 -0.743742 3.156369
H  1.543913 -2.54338 3.007388
H  -1.362132 2.08992 2.555172
H  3.178669 2.03733 0.460574
H  -0.069491 4.213401 2.348371
H  1.751499 1.207622 -1.676634
H  4.09362 -2.115111 -0.16527
H  3.003811 1.124816 -3.83397
H  5.373377 -2.197901 -2.336032
H  4.825223 -0.572389 -4.174346
