program: Gaussian 09
title: 000245686
version: EM64L-G09RevD.01
frameworkgroup: C1[X(C22H22O7)]
method: RPBEPBE
basis: SDD
operation: Freq
keyword: #pfreq=noraman
keyword: PBEPBE/SDD
title: #p freq=noraman PBEPBE/SDD
converged: YES YES NO NO
title: Mulliken charges:
elementType: O O O O O O O C C C C C C C C C C C C C C C C C C C C C C H H H H H H H H H H H H H H H H H H H H H H
charge: -0.267576 -0.258569 -0.253827 -0.236709 -0.287127 -0.273809 -0.272490 0.201421 0.163926 0.569268 -0.516092 -0.339194 -0.415597 -0.204253 0.621551 0.051968 0.233566 0.280241 -0.567490 -0.586938 -0.314922 -0.294134 -0.168434 -0.398723 -0.357666 0.242942 -0.516456 -0.538091 -0.533809 0.249919 0.251844 0.239020 0.241867 0.234294 0.247976 0.248601 0.243468 0.262695 0.226283 0.233197 0.219146 0.242871 0.257005 0.215035 0.233128 0.219829 0.224078 0.248531 0.245018 0.223411 0.229804
chargesum: 0.00000
title: Mulliken charges with hydrogens summed into heavy atoms:
elementType: O O O O O O O C C C C C C C C C C C C C C C C C C C C C C
charge: -0.267576 -0.258569 -0.253827 -0.236709 -0.287127 -0.273809 -0.272490 0.201421 0.163926 0.569268 -0.266173 -0.087350 -0.176577 0.271907 0.621551 0.051968 0.233566 0.280241 -0.319514 -0.338337 -0.071454 -0.031440 0.057850 0.053621 -0.114795 0.242942 0.188713 0.154346 0.164425
polarizability: 4.51511993e+02 9.15394433e+00 2.64706976e+02 -1.25627137e+01 2.17079058e+01 2.54321906e+02
1716.lowfreq: -7.5412 -0.9456 -0.0004 0.0006 0.0010 0.5085 8.2119 9.3856 13.7083
frequency: 8.0866 9.3596 13.6160 33.6646 45.7664 53.6989 57.1957 60.8223 75.3710 81.3214 92.6679 107.1400 110.9315 121.8407 145.5731 159.0164 166.5859 181.5498 195.7737 199.6403 211.7517 223.2248 231.3330 238.6950 267.2215 279.5195 290.7991 299.4524 316.7944 332.1613 347.2173 352.4107 355.5588 409.0037 422.1968 442.6001 462.6681 475.4818 505.5761 518.1894 553.6784 575.9918 590.9038 604.6497 607.0710 622.9126 647.7723 678.0214 691.9448 694.5938 720.1058 732.6223 758.7207 766.6021 785.4728 804.8384 828.1486 831.8223 839.8709 852.1214 869.8019 872.1501 879.7155 888.8784 911.2421 935.8455 940.8203 951.8784 962.2054 970.4328 979.3819 986.3740 1008.9270 1019.1555 1057.7800 1068.7346 1089.7586 1102.6432 1106.5922 1111.3363 1111.5642 1113.2376 1126.1684 1135.0894 1145.4002 1154.3377 1157.7044 1164.3937 1193.8857 1219.4973 1226.0278 1234.9914 1252.2204 1269.1627 1270.9829 1297.9030 1307.5915 1322.7864 1335.5908 1351.2615 1364.3389 1391.3241 1395.7065 1414.5059 1422.5805 1443.6915 1449.6486 1451.8730 1452.6839 1455.1135 1467.1456 1467.7996 1469.5791 1473.5184 1477.9447 1478.9516 1485.9007 1490.2261 1577.7522 1587.1433 1606.0293 1606.9862 1625.1536 1641.3112 1660.9019 2958.4230 2965.3801 2980.8936 3002.2352 3028.2135 3046.7054 3055.8397 3087.9157 3095.6732 3099.7309 3100.0742 3106.7683 3119.1466 3126.1816 3127.5874 3130.6114 3142.6510 3153.7389 3158.1814 3172.5795 3176.4040 3182.8850
redmass: 6.1965 5.3955 5.2362 5.1857 4.8084 3.2514 3.5825 2.7579 4.2800 2.9773 4.7190 3.6239 3.5738 3.3003 1.5862 3.8689 3.8387 3.0085 2.2967 3.2066 3.5531 4.8106 4.8881 1.5338 3.2494 2.1389 2.2787 4.9187 4.0334 3.5878 4.4406 4.3084 3.9017 3.3973 4.6674 4.1427 4.4724 5.7996 6.0578 6.1099 4.7632 4.1198 5.6953 6.0629 3.5853 4.2455 4.7579 9.2245 4.8922 5.5275 3.7802 4.6543 6.0478 2.8410 5.7888 1.6241 1.5383 2.7687 6.2126 2.1307 3.8782 2.3024 2.1911 1.9661 3.1764 1.3572 5.3965 8.9464 5.1334 3.4684 1.5445 1.9829 1.2010 4.0147 3.8260 1.4937 6.7695 2.5142 1.4614 1.3923 2.0211 1.2680 1.0657 1.5525 1.5796 1.5694 1.4640 1.8191 1.7162 2.1625 1.1661 1.6105 3.3520 1.3267 1.6550 1.3904 1.4434 1.4764 2.3653 1.9315 1.2761 4.3214 3.0578 1.7051 1.4617 1.2125 1.6191 1.2930 2.8208 1.0921 1.0750 1.0502 1.1685 1.0957 1.0568 1.6971 1.6988 2.3035 7.3714 6.0798 7.7368 9.0847 8.1523 5.5807 5.8452 1.0332 1.0326 1.0327 1.0600 1.0571 1.1039 1.1042 1.0999 1.1007 1.0936 1.0898 1.1114 1.0937 1.1000 1.0992 1.1044 1.0899 1.0906 1.0914 1.0901 1.0924 1.0957
irintensity: 0.0687 0.0185 0.0098 1.3819 0.2204 1.5145 8.6598 10.9115 1.8907 13.3086 1.0634 0.9253 1.9962 9.6626 1.5987 3.2582 5.1388 2.4399 0.3710 0.3611 3.5750 6.9509 1.4556 3.6930 6.3699 0.0709 0.2298 8.0502 5.0088 3.3789 8.5091 3.1373 21.9462 15.0967 9.0588 8.9629 4.2125 18.7999 7.0775 2.3324 4.9525 7.1318 8.6738 9.8820 13.9508 10.1853 1.6295 0.9545 30.8568 1.8640 2.3300 8.0981 7.6236 18.4252 9.3661 22.8751 1.7778 49.0026 51.6712 52.6699 9.0746 56.8878 4.3764 2.2743 20.3231 2.3480 231.3629 36.3975 9.3004 188.5661 112.2170 33.8522 49.3393 4.1878 13.5742 9.2829 285.8701 608.2050 15.6224 65.2623 268.5040 7.4840 0.3790 28.5796 1.9599 34.5043 28.8957 14.3294 49.2000 13.1520 21.3786 96.1784 205.4897 23.3321 406.6513 36.9219 2.0643 13.2597 53.7430 19.7298 0.3086 34.8950 32.9425 98.7691 27.1644 0.7574 56.0280 66.9070 94.7741 20.5541 30.8109 17.3798 81.2661 101.3291 30.1660 45.5801 78.2118 160.3614 177.0343 123.4420 10.1060 231.9299 3.7057 264.3208 36.1394 52.8047 53.8398 104.7925 133.9048 51.3088 45.5598 41.8834 35.9420 3.5723 9.0297 3.1158 33.6566 30.3856 24.4232 23.7745 20.3470 9.6282 4.3468 11.4013 4.9621 3.7178 5.0772
temp: 298.150 k
press: 1.00000 atm
elementType: 8 8 8 8 8 8 8 6 6 6 6 6 6 6 6 6 6 6 6 6 6 6 6 6 6 6 6 6 6 1 1 1 1 1 1 1 1 1 1 1 1 1 1 1 1 1 1 1 1 1 1
symmnumber: 1
zpe: 1032188.4 jmol-1
zpe.correction: 0.393140 hartree
zpe.thermalcorrener: 0.422005 hartree
zpe.thermalcorrenthalpy: 0.422949 hartree
zpe.thermalcorrgfe: 0.327941 hartree
zpe.sumelectzpe: -1375.887416 hartree
zpe.sumelectthermal: -1375.858551 hartree
zpe.sumelectthermalent: -1375.857606 hartree
zpe.sumelectthermalfe: -1375.952615 hartree
dipole: 0.2468 -2.0725 1.2087
dipole: 2.4118
quadrupole: -167.7533 -151.7187 -154.3736
quadrupole: 7.9806 10.7723 8.7131
quadrupole: -9.8048 6.2299 3.5749 7.9806 10.7723 8.7131
hfenergy: -1376.2805557 hartree
pointgroup: C01 [X(C22H22O7)]
dipole: -0.1169529 0.5656642 -0.752824 debye
polarizability: 449.3913217|25.3747578|251.5513911|-5.2055567|19.7789058|269.5981609 unknown
InChI: InChI=1S/C22H22O7/c1-24-19-12-16(13-20(25-2)22(19)26-3)7-9-21(23)27-10-4-5-15-6-8-17-18(11-15)29-14-28-17/h4-9,11-13H,10,14H2,1-3H3
charge 0 multiplicity 1
51 atoms
O  -7.174591 1.950043 -0.499496
O  -7.852064 0.661681 -2.406776
O  7.104448 1.583166 -0.539191
O  5.564435 2.523738 1.418621
O  6.282885 -0.575481 -2.150247
O  -0.837388 -0.991923 2.647616
O  -0.42413 -2.437857 0.843765
C  -6.426606 0.745439 -0.570622
C  -6.829663 -0.012036 -1.695245
C  -4.856744 -0.976533 0.062138
C  -5.457973 0.29974 0.321544
C  -6.271569 -1.261436 -1.970906
C  -5.277115 -1.728018 -1.072099
C  -7.957021 1.999028 -1.761039
C  3.365972 -0.290308 0.224864
C  5.865133 0.970349 -0.367651
C  5.047977 1.431991 0.7145
C  5.411923 -0.143921 -1.135102
C  3.817978 0.807958 1.005947
C  4.173863 -0.757214 -0.846082
C  -3.812116 -1.547459 0.930043
C  2.094168 -0.971187 0.478228
C  -3.237038 -0.972129 2.026228
C  -2.175793 -1.66037 2.839786
C  1.172287 -0.683175 1.450493
C  -0.067856 -1.469363 1.566824
C  7.454012 2.090496 -1.884493
C  4.79047 3.010455 2.563478
C  5.900058 -1.770214 -2.908008
H  -5.174424 0.904056 1.186617
H  -6.586461 -1.849333 -2.836352
H  -4.808551 -2.700261 -1.261061
H  -9.013015 2.198531 -1.522055
H  -7.513498 2.75703 -2.433597
H  3.199494 1.176082 1.827738
H  3.823245 -1.610961 -1.434192
H  -3.453893 -2.546072 0.640638
H  1.846706 -1.809971 -0.18932
H  -3.512593 0.040618 2.349388
H  -2.078603 -2.724058 2.561955
H  -2.344616 -1.554731 3.92421
H  1.299719 0.126255 2.175567
H  7.508386 1.267657 -2.61527
H  6.712531 2.844696 -2.209726
H  8.438017 2.565062 -1.754192
H  3.794458 3.381661 2.251336
H  4.669791 2.222545 3.3322
H  5.38383 3.840902 2.972631
H  6.73083 -1.942224 -3.607917
H  4.962862 -1.606577 -3.474211
H  5.785937 -2.646168 -2.241303
