program: Gaussian 09
title: 000245630
version: EM64L-G09RevD.01
frameworkgroup: C1[X(C8H9BrN2O)]
method: RPBEPBE
basis: SDD
operation: Freq
keyword: #p
keyword: freq=noraman
keyword: PBEPBE/SDD
title: #p freq=noraman PBEPBE/SDD
converged: NO YES NO NO
title: Mulliken charges:
elementType: Br O N N C C C C C C C C H H H H H H H H H
charge: -0.027398 -0.267438 -0.429512 -0.602180 0.475106 -0.462909 -0.291006 -0.429329 -0.182984 -0.179559 -0.267362 0.208361 0.342303 0.241498 0.241448 0.251278 0.228302 0.227507 0.249462 0.347417 0.326997
chargesum: 0.00000
title: Mulliken charges with hydrogens summed into heavy atoms:
elementType: Br O N N C C C C C C C C
charge: -0.027398 -0.267438 -0.087209 0.072234 0.475106 0.020037 -0.039728 -0.201028 -0.182984 0.047947 -0.017900 0.208361
polarizability: 1.70416367e+02 2.92720647e+00 1.39033421e+02 3.98091858e-03 1.07422590e-02 5.02162810e+01
1716.lowfreq: -9.8259 -3.7355 -0.0007 -0.0005 -0.0004 2.9005 43.4570 45.0654 69.8308
frequency: 43.3222 44.9180 69.8196 124.8432 167.7714 172.3579 224.4703 267.0411 294.8248 336.2002 435.6289 481.3033 499.8500 537.4688 545.6878 561.1953 573.0499 615.5266 644.0422 660.6305 679.4604 765.7925 836.8465 837.3566 863.7841 882.4754 962.4635 967.4582 1006.5204 1058.6538 1064.6096 1089.8107 1159.3045 1177.2541 1200.6934 1258.3785 1287.0990 1307.6282 1373.8130 1385.4754 1428.3957 1455.5207 1482.8456 1512.0873 1561.3625 1602.2550 1624.9196 1658.7449 2911.3934 2943.4745 3126.1502 3149.6342 3170.6484 3183.0682 3492.1879 3519.4012 3671.5804
redmass: 7.6076 4.2585 7.0905 2.5970 4.5224 7.9197 4.2230 7.0609 9.7413 3.9301 2.9140 1.3452 3.2260 1.3026 6.2601 4.4121 1.1210 5.4477 1.5949 6.9570 1.9896 1.3719 1.6897 3.3645 1.4294 4.4309 1.3244 5.5557 1.9077 2.1623 1.9629 1.6501 3.7891 1.0774 1.0805 1.4724 1.2730 1.9387 3.0895 4.2659 2.9589 1.8442 1.1200 3.6128 5.4416 1.3855 6.6420 3.7395 1.0565 1.1016 1.0873 1.0945 1.0913 1.0963 1.0767 1.0451 1.1045
irintensity: 3.7748 5.6173 5.0297 2.6347 4.7546 13.3413 0.2090 0.5078 5.8661 6.2663 8.1890 10.8164 14.7198 248.1358 8.6537 3.0900 12.7097 3.4466 123.4052 18.8284 40.4843 69.4894 41.7063 18.3948 2.9660 44.6581 1.2487 27.1005 0.6916 5.1143 8.4747 0.2738 11.6001 6.7171 0.5221 12.9316 9.8730 72.0131 197.3401 48.3855 7.9988 5.1951 46.0270 257.5478 117.3312 104.4264 312.2998 258.6063 86.7674 35.5352 9.2035 19.3806 10.1135 3.3076 196.5841 45.2571 32.2125
temp: 298.150 k
press: 1.00000 atm
elementType: 35 8 7 7 6 6 6 6 6 6 6 6 1 1 1 1 1 1 1 1 1
symmnumber: 1
zpe: 418444.7 jmol-1
zpe.correction: 0.159377 hartree
zpe.thermalcorrener: 0.171112 hartree
zpe.thermalcorrenthalpy: 0.172057 hartree
zpe.thermalcorrgfe: 0.119336 hartree
zpe.sumelectzpe: -507.576263 hartree
zpe.sumelectthermal: -507.564528 hartree
zpe.sumelectthermalent: -507.563584 hartree
zpe.sumelectthermalfe: -507.616305 hartree
dipole: 3.3971 -2.9137 -0.0020
dipole: 4.4755
quadrupole: -77.3408 -65.7905 -84.9284
quadrupole: -21.6115 -0.0145 0.0086
quadrupole: -1.3209 10.2294 -8.9085 -21.6115 -0.0145 0.0086
hfenergy: -507.7356406 hartree
pointgroup: C01 [X(C8H9Br1N2O1)]
dipole: 1.5690323 0.7990864 0.0001486 debye
dipolederiv: -0.2839272 0.2480022 -0.0001747 0.3437774 -0.5755357 0.0002186 0.0000528 0.0000536 -0.0680198 -0.8172843 0.1414694 0.0001127 -0.1302248 -1.0026343 -0.0005195 -0.0001594 -0.0000937 -0.3523581 -1.827236 -0.1794489 0.0002198 0.0974997 -0.2792473 0.0003803 -0.0010902 0.0003671 -0.4555303 -0.8991731 -0.5233907 -0.0003323 -0.4808492 -0.705843 0.0002019 -0.0004688 0.0000043 -0.7054868 1.8280782 0.0929315 -0.000144 -0.1860672 0.0750565 0.0000123 0.0002342 -0.0002278 0.1708221 0.0322526 0.2143825 -0.0003528 0.7590284 0.3243029 -0.0004325 -0.0005749 0.0000151 0.4133138 -0.6206638 -0.0413703 0.0000801 0.637261 -0.271216 -0.0000768 -0.0004318 0.0002174 -0.2230129 -0.501077 0.0712177 0.0000232 -0.3904848 -0.0053911 -0.0001036 0.0001664 -0.0001048 -0.242457 0.6915049 -0.2542793 0.0000842 -0.5741448 1.1081437 -0.0007279 0.0000429 -0.000546 -0.0863676 0.3649297 -0.2429777 0.0000973 -0.0263316 0.2174243 -0.0002575 0.0000204 -0.0002951 -0.1158582 -0.3239726 0.1381843 -0.0001318 0.134706 -0.6155008 0.0003518 -0.0001075 0.0002784 -0.1827306 1.47707 0.2573745 0.0004135 0.3792077 1.4318932 0.000779 0.0008483 0.000604 0.1995402 0.4279433 0.0229222 0.000048 -0.1888672 0.1488314 0.0000274 0.0005729 -0.0001614 0.3092661 0.0142652 0.0166259 -0.0118498 -0.1711018 -0.0594295 0.0983608 0.0539347 0.1181658 -0.0643021 0.0144433 0.0166071 0.0117381 -0.1708247 -0.0598796 -0.0983115 -0.0531361 -0.118278 -0.0636646 0.0488115 -0.0812462 0.0001064 -0.1048249 -0.0140756 0.0001865 0.0001157 0.0001446 0.1759529 0.0080931 0.1143332 -0.0000475 0.0829229 -0.0491401 0.0001414 -0.0000396 0.0001353 0.1726958 0.0244114 -0.0747621 0.0000878 -0.0817773 -0.0921242 0.0001994 0.0000873 0.0002002 0.1548361 -0.0617007 -0.000153 0.000056 0.0088941 0.0999225 0.0000521 0.0000781 0.0000467 0.1844734 0.1919171 0.0223498 -0.0000361 -0.0046786 0.1679959 -0.0001912 -0.0000976 -0.0001708 0.3932783 0.2113145 0.0412278 0.0000019 0.0668797 0.1564467 -0.0002912 -0.0000479 -0.0003547 0.3856095 unknown
polarizability: 167.3326036|-9.7896162|142.1171684|-0.0126249|-0.0367572|50.2162966 unknown
InChI: InChI=1S/C8H9BrN2O/c9-6-2-1-3-7(4-6)11-5-8(10)12/h1-4,11H,5,10H2
charge 0 multiplicity 1
21 atoms
Br -3.467214 2.427361 -0.001735
O  3.637026 -1.021074 -0.001936
N  1.009891 -0.521913 -0.000438
N  4.248526 1.220824 -0.000768
C  -0.378346 -0.498907 -0.000324
C  1.844372 0.660275 -0.001866
C  -1.100132 0.734105 -0.001085
C  -1.115363 -1.72375 0.000684
C  -2.506346 0.702861 -0.000748
C  -2.520034 -1.708267 0.000906
C  -3.250155 -0.49098 0.000226
C  3.317927 0.204225 -0.001876
H  1.524651 -1.408644 -0.001272
H  1.664989 1.297842 -0.896965
H  1.665142 1.299821 0.891794
H  -0.576174 1.693057 -0.001975
H  -0.574153 -2.677285 0.001306
H  -3.068885 -2.656576 0.001669
H  -4.342412 -0.482666 0.000477
H  5.238311 0.975282 -0.000727
H  3.980481 2.20381 0.000156
