program: Gaussian 09
title: 000245637
version: EM64L-G09RevD.01
frameworkgroup: C1[X(C14H10Cl2N2OS)]
method: RPBEPBE
basis: SDD
operation: Freq
keyword: #p
keyword: freq=noraman
keyword: PBEPBE/SDD
title: #p freq=noraman PBEPBE/SDD
converged: YES YES NO NO
title: Mulliken charges:
elementType: Cl Cl S O N N C C C C C C C C C C C C C C H H H H H H H H H H
charge: -0.053320 -0.038185 -0.033981 -0.219445 -0.407297 0.056612 0.307396 0.555339 -0.316710 -0.330297 0.166386 -0.282645 -0.345420 -0.212898 -0.231610 -0.222911 -0.216969 -0.218097 -0.372388 -0.090528 0.280504 0.298156 0.231124 0.241066 0.238490 0.282798 0.262947 0.237018 0.308379 0.126484
chargesum: 0.00000
title: Mulliken charges with hydrogens summed into heavy atoms:
elementType: Cl Cl S O N N C C C C C C C C C C C C C C
charge: -0.053320 -0.038185 0.092503 -0.219445 -0.098918 0.056612 0.307396 0.555339 -0.316710 -0.049793 0.166386 -0.282645 -0.047264 0.018226 0.009456 0.015579 0.065829 0.044851 -0.135370 -0.090528
polarizability: 4.25972889e+02 1.66215400e+00 2.17644679e+02 1.73395528e+01 3.24807053e+00 9.05631520e+01
1716.lowfreq: -6.9106 -5.8512 -1.6287 -0.0016 0.0003 0.0017 11.4369 24.7827 31.6600
frequency: 9.5087 24.7817 31.6337 48.5732 71.3344 99.9683 130.5878 132.6007 153.0927 161.5386 185.3707 199.4443 208.5269 238.4929 267.7509 295.9898 326.6682 355.4110 369.2026 372.6322 416.2951 419.6194 441.2877 460.1754 476.1361 512.1319 552.7865 560.9097 639.1125 649.3366 677.3467 678.2993 703.6072 716.8997 728.8846 742.6671 776.5175 826.7271 841.7141 863.4841 871.7923 879.2063 904.8983 942.4987 962.7494 988.8946 997.5278 1019.4233 1023.6555 1027.1543 1064.2970 1081.0352 1122.2378 1133.5547 1144.7211 1178.0260 1222.8216 1231.5003 1271.4106 1273.0685 1329.1569 1360.0539 1366.7168 1393.1305 1416.3423 1452.5060 1457.3792 1524.8308 1547.0341 1565.9594 1575.9964 1593.4282 1596.1706 1615.9494 2443.6006 3028.0589 3128.3011 3145.6611 3158.5228 3158.7265 3174.2958 3179.9854 3186.9019 3321.8339
redmass: 6.9605 7.9371 8.9396 5.9194 4.9760 4.9129 7.4981 1.7214 12.9299 5.6975 4.7779 10.8978 3.4646 6.2199 4.8529 5.5970 10.3538 7.2626 5.4932 11.2077 9.3186 4.3232 5.5096 3.7181 4.3276 5.0816 4.1322 6.4326 6.4167 7.0015 2.1795 2.0153 4.5185 3.7953 7.8795 2.0939 1.8784 5.3818 1.3546 1.4051 1.3939 1.4991 2.7730 1.5232 1.3812 1.3578 1.3604 4.2369 6.4743 4.5756 2.6626 2.5161 1.7871 1.9378 1.9858 1.0641 1.8666 2.2036 1.4891 1.5387 2.0768 2.8176 10.3856 5.2743 2.1238 2.3261 2.6669 1.8773 7.8293 6.1988 5.5869 7.0311 6.3047 6.2796 1.0382 1.0882 1.0877 1.0893 1.0936 1.0892 1.1004 1.0968 1.0937 1.0776
irintensity: 0.7987 0.8395 1.7526 3.2945 0.4510 3.2271 0.0304 8.8390 0.1787 0.1045 0.6348 2.0075 11.6578 7.8013 17.8489 10.6191 11.4789 1.8502 6.8403 5.0692 2.2856 5.7247 6.1619 5.0904 11.1119 0.8023 6.7827 4.7251 9.9483 0.5020 83.8479 12.5390 30.0176 4.1400 51.0389 47.1918 35.7493 38.0824 30.2554 19.6464 1.3019 11.6702 22.6622 35.5359 1.9792 3.8494 3.2768 56.5875 33.6301 6.8681 33.3189 52.1264 34.0046 40.3016 176.5724 1.5925 33.9895 344.8343 0.9016 82.2580 28.8360 5.8283 2.9142 19.9689 20.9552 43.4440 94.7411 330.7859 12.8417 4.8446 31.8000 100.6671 24.1003 192.1618 26.8974 38.0952 2.9217 8.0201 7.1412 0.2960 24.5497 2.2594 0.5485 38.3252
temp: 298.150 k
press: 1.00000 atm
elementType: 17 17 16 8 7 7 6 6 6 6 6 6 6 6 6 6 6 6 6 6 1 1 1 1 1 1 1 1 1 1
symmnumber: 1
zpe: 534898.6 jmol-1
zpe.correction: 0.203732 hartree
zpe.thermalcorrener: 0.222600 hartree
zpe.thermalcorrenthalpy: 0.223544 hartree
zpe.thermalcorrgfe: 0.152717 hartree
zpe.sumelectzpe: -2040.964932 hartree
zpe.sumelectthermal: -2040.946064 hartree
zpe.sumelectthermalent: -2040.945120 hartree
zpe.sumelectthermalfe: -2041.015947 hartree
dipole: -4.3279 3.6210 -1.2238
dipole: 5.7741
quadrupole: -112.4296 -134.3077 -142.0529
quadrupole: -11.0818 5.2450 2.6941
quadrupole: 17.1671 -4.7110 -12.4562 -11.0818 5.2450 2.6941
hfenergy: -2041.1686642 hartree
pointgroup: C01 [X(C14H10Cl2N2O1S1)]
dipole: -1.6858885 -1.359602 -0.6854447 debye
polarizability: 424.817602|18.4623899|147.0878392|-18.6988808|62.5804653|162.2752788 unknown
InChI: InChI=1S/C14H10Cl2N2OS/c15-10-6-5-9(12(16)7-10)8-17-18-14(19)11-3-1-2-4-13(11)20/h1-8,18,20H
charge 0 multiplicity 1
30 atoms
Cl 3.309277 -2.466666 -1.753577
Cl 7.195297 0.896834 0.290688
S  -2.838943 -0.727531 -2.241501
O  -1.723254 1.60793 1.470889
N  -0.953047 -0.109946 0.077976
N  0.36841 0.243181 0.245091
C  -3.387776 0.190432 0.423918
C  2.695737 -0.192759 -0.185364
C  -3.901528 -0.439612 -0.74815
C  -4.293974 0.468481 1.486189
C  -1.966437 0.648756 0.691077
C  3.723989 -0.976333 -0.773448
C  3.105458 0.952778 0.562687
C  -5.272034 -0.791673 -0.821306
C  -5.650802 0.106749 1.419145
C  -6.140174 -0.536766 0.259345
C  5.090355 -0.665306 -0.642877
C  4.459708 1.293233 0.714066
C  1.274306 -0.527103 -0.325284
C  5.436508 0.474773 0.106125
H  -3.887396 0.986364 2.360607
H  2.318954 1.561749 1.019018
H  -5.671029 -1.25576 -1.730491
H  -6.319949 0.324843 2.257252
H  -7.194222 -0.824458 0.184025
H  5.855111 -1.290577 -1.108822
H  4.754999 2.173852 1.290621
H  1.018691 -1.426864 -0.912937
H  -1.211871 -0.917511 -0.514626
H  -3.679764 -1.652794 -2.834336
