program: Gaussian 09
title: 000245640
version: EM64L-G09RevD.01
frameworkgroup: C1[X(C14H20Cl2N2O2S)]
method: RPBEPBE
basis: SDD
operation: Freq
keyword: #p
keyword: freq=noraman
keyword: PBEPBE/SDD
title: #p freq=noraman PBEPBE/SDD
converged: YES YES NO NO
title: Mulliken charges:
elementType: Cl Cl S O O N N C C C C C C C C C C C C C C H H H H H H H H H H H H H H H H H H H H
charge: -0.067150 -0.066378 0.165300 -0.409949 -0.239036 -0.133012 -0.591816 0.449420 -0.419359 -0.420542 0.506302 -0.356927 -0.356576 -0.812633 -0.397622 -0.417773 -0.555216 -0.553795 -0.709773 -0.134643 0.225823 0.236211 0.273705 0.273652 0.234760 0.220039 0.219996 0.274304 0.251535 0.232384 0.233185 0.262598 0.289702 0.262161 0.291505 0.251850 0.271377 0.261076 0.295765 0.281233 0.378314
chargesum: 0.00000
title: Mulliken charges with hydrogens summed into heavy atoms:
elementType: Cl Cl S O O N N C C C C C C C C C C C C C C
charge: -0.067150 -0.066378 0.165300 -0.031635 -0.239036 -0.133012 -0.014817 0.449420 0.090557 0.087870 0.506302 -0.136888 -0.136579 -0.286793 -0.165238 -0.184588 -0.002915 -0.000129 -0.186546 0.126433 0.225823
polarizability: 3.29017509e+02 1.13637507e+01 1.72198071e+02 1.02822376e+01 1.45368355e+01 1.68877863e+02
1716.lowfreq: -12.2283 -6.2229 -0.4364 -0.0011 0.0007 0.0014 4.7203 12.8459 24.7454
frequency: -10.9364 12.1607 24.5300 31.0936 36.4170 41.2254 53.7519 73.5834 75.6250 81.1441 93.7587 114.8571 117.9060 152.3658 180.9001 207.8369 216.7130 226.4016 254.8304 274.7085 288.0766 329.5111 341.9006 360.5369 377.6338 410.4535 424.3479 441.5506 452.3329 501.3937 516.5454 521.4735 549.7967 588.6916 600.6727 606.3647 615.3464 636.3904 640.4669 666.8993 683.8066 722.0493 738.7815 752.7175 802.7948 805.6276 822.6215 866.1250 870.0842 889.2683 914.1072 920.7178 939.2437 947.2437 952.6295 998.0038 1007.2278 1007.8984 1028.6753 1049.3355 1060.4471 1089.1796 1106.6297 1123.2609 1149.4208 1161.0163 1173.1508 1180.7741 1183.5628 1201.7250 1226.7578 1232.9984 1245.1568 1248.1906 1260.4344 1266.1066 1293.6176 1303.9056 1324.9087 1327.0457 1353.1116 1355.0916 1378.5339 1388.4269 1398.1439 1423.1746 1429.4116 1440.2874 1442.0361 1463.6070 1464.6038 1489.0964 1522.2009 1567.7154 1611.2111 1631.0791 1675.4741 2971.7658 2975.2231 3003.5400 3010.2499 3054.6771 3055.0042 3063.5026 3071.7331 3078.2245 3087.9560 3091.6344 3122.3525 3124.5109 3144.1767 3144.7123 3156.3161 3162.3368 3477.5113 3499.5168 3618.3043
redmass: 7.0878 8.3856 8.8529 6.1443 9.9197 8.5543 7.2591 4.8765 4.7449 6.6093 4.2008 7.9481 3.5836 4.5020 3.7919 2.5237 3.0297 2.2051 3.2367 3.1709 2.0040 5.9898 5.4134 2.4150 3.1567 3.0854 3.3428 2.8465 3.7915 2.4963 2.1294 1.6291 3.1166 2.5493 4.9228 4.2817 1.4609 5.5760 4.1479 3.4876 4.3420 4.4941 3.7961 3.0635 1.9792 1.8034 1.9507 2.4461 1.8136 1.5248 1.6918 1.8662 1.4294 2.1178 1.3565 3.0323 5.2726 1.8497 2.6246 1.8436 2.7999 1.5052 1.4253 1.4163 1.2139 1.1522 1.3628 1.3739 1.8421 1.1730 1.2145 1.3870 2.2507 1.2921 1.5225 1.5653 1.2603 1.1928 1.2939 1.2517 1.4129 1.4951 4.5009 1.6438 1.5493 1.2132 2.7296 1.1103 1.1381 1.1207 1.1300 1.1528 2.7210 6.5505 1.2276 6.3697 4.5814 1.0687 1.0689 1.0583 1.0580 1.0585 1.0580 1.0883 1.0928 1.0924 1.1071 1.1040 1.0889 1.0887 1.1100 1.1099 1.0937 1.0940 1.0445 1.0637 1.0995
irintensity: 0.3845 0.8766 0.0757 1.3391 0.6808 2.8305 3.6473 1.7658 5.6706 0.5552 5.3775 1.1346 1.4531 3.5690 0.1032 22.4041 9.3731 23.4281 10.2330 3.8567 26.6543 0.4747 3.1680 0.1755 4.2225 1.2667 4.1931 13.7460 24.2747 18.7880 105.2263 175.3551 6.5220 16.2800 14.0445 24.9649 229.6314 6.8408 31.6204 2.5547 1.5130 70.4067 7.4495 4.2536 9.8256 0.7469 51.8444 12.1591 0.4621 1.1803 11.3893 62.6170 1.5237 14.7454 0.2530 0.2183 43.7611 3.7638 8.4194 7.2212 177.5392 13.2252 0.8357 4.0517 2.9533 9.4399 11.8073 11.4188 60.7521 49.6555 40.8900 67.5617 12.5665 2.3722 7.1884 12.9247 1.7312 23.2137 6.9207 0.6001 86.2970 139.4614 0.6125 21.0280 5.8482 25.3627 6.0696 4.1002 14.9564 23.1319 8.8594 0.0452 236.6019 6.3589 135.5486 214.6357 152.1680 39.3135 19.6821 40.4250 17.6941 36.8766 1.6346 9.1629 1.9369 8.5573 7.6687 9.5353 5.3129 32.0491 15.6412 25.7415 26.9193 12.5067 16.2965 17.1463 8.9894
temp: 298.150 k
press: 1.00000 atm
elementType: 17 17 16 8 8 7 7 6 6 6 6 6 6 6 6 6 6 6 6 6 6 1 1 1 1 1 1 1 1 1 1 1 1 1 1 1 1 1 1 1 1
symmnumber: 1
zpe: 849132.7 jmol-1
zpe.correction: 0.323418 hartree
zpe.thermalcorrener: 0.346270 hartree
zpe.thermalcorrenthalpy: 0.347214 hartree
zpe.thermalcorrgfe: 0.266550 hartree
zpe.sumelectzpe: -2122.003001 hartree
zpe.sumelectthermal: -2121.980149 hartree
zpe.sumelectthermalent: -2121.979204 hartree
zpe.sumelectthermalfe: -2122.059869 hartree
dipole: 0.4486 -2.3842 0.5217
dipole: 2.4815
quadrupole: -161.4787 -143.1731 -144.4994
quadrupole: 14.4142 0.4822 20.2125
quadrupole: -11.7616 6.5440 5.2176 14.4142 0.4822 20.2125
hfenergy: -2122.3264185 hartree
pointgroup: C01 [X(C14H20Cl2N2O2S1)]
dipole: 0.2358528 0.9209241 -0.2223492 debye
polarizability: 326.7440693|-21.530222|174.8544169|-10.0025287|15.2197337|168.4949564 unknown
InChI: InChI=1S/C14H20Cl2N2O2S/c15-5-7-18(8-6-16)12-3-1-11(2-4-12)9-21-10-13(17)14(19)20/h1-4,13,19H,5-10,17H2
charge 0 multiplicity 1
41 atoms
Cl 6.228662 1.666598 -1.102368
Cl 5.035097 -3.204393 1.062888
S  -2.810236 0.033568 1.202372
O  -4.667798 -0.880596 -1.683033
O  -6.239296 -1.344907 -0.035718
N  3.772839 -0.319445 -0.04525
N  -6.585511 1.530829 -0.062326
C  2.405116 0.018179 -0.060528
C  4.705938 0.337458 0.879275
C  4.311101 -1.346598 -0.946128
C  -0.40159 0.72111 -0.096794
C  1.866619 0.997699 0.834552
C  1.491017 -0.600083 -0.971282
C  -1.864189 1.077204 -0.112751
C  0.499896 1.327411 0.814069
C  0.128286 -0.248814 -0.98371
C  5.145617 1.745511 0.451427
C  4.043988 -2.791965 -0.499503
C  -4.470567 0.947819 1.195191
C  -5.254065 0.912331 -0.152099
C  -5.456717 -0.539647 -0.585066
H  4.253017 0.41506 1.889355
H  5.594306 -0.304343 0.999302
H  5.397045 -1.188207 -1.052553
H  3.888457 -1.221983 -1.964426
H  2.508913 1.507889 1.558023
H  1.834417 -1.357692 -1.681344
H  -2.323999 0.86002 -1.090364
H  -2.035305 2.134451 0.156634
H  0.123717 2.072841 1.525361
H  -0.540848 -0.744707 -1.697571
H  5.775793 2.223906 1.217626
H  4.300566 2.391882 0.175564
H  4.382038 -3.519248 -1.254389
H  2.994008 -2.966845 -0.225253
H  -4.294515 1.999962 1.485548
H  -5.065803 0.451337 1.981915
H  -4.672335 1.426632 -0.934168
H  -7.256123 1.003566 0.504593
H  -6.591619 2.539043 0.103915
H  -4.804734 -1.843333 -1.901588
