program: Gaussian 09
title: 000245621
version: EM64L-G09RevD.01
frameworkgroup: C1[X(C13H22N2O3)]
method: RPBEPBE
basis: SDD
operation: Freq
keyword: #p
keyword: freq=noraman
keyword: PBEPBE/SDD
title: #p freq=noraman PBEPBE/SDD
converged: YES YES NO NO
title: Mulliken charges:
elementType: O O O N N C C C C C C C C C C C C C H H H H H H H H H H H H H H H H H H H H H H
charge: -0.209637 -0.216644 -0.221465 -0.370730 -0.377121 0.120477 -0.467032 -0.459341 -0.400262 -0.027497 -0.363873 0.131903 0.147644 -0.358686 -0.718313 -0.717556 0.147963 -0.700051 0.264749 0.210718 0.242138 0.223483 0.246847 0.207739 0.194498 0.202904 0.207128 0.199120 0.199932 0.365596 0.364585 0.225476 0.207082 0.214881 0.207441 0.214523 0.218733 0.212445 0.212117 0.218085
chargesum: 0.00000
title: Mulliken charges with hydrogens summed into heavy atoms:
elementType: O O O N N C C C C C C C C C C C C C
charge: -0.209637 -0.216644 -0.221465 -0.005135 -0.012536 0.120477 0.008434 0.006280 0.054324 0.167001 0.046160 0.131903 0.147644 0.040367 -0.070874 -0.076859 0.147963 -0.057405
polarizability: 1.63486354e+02 1.08588556e+01 1.76549119e+02 4.37118523e+00 -1.96270815e+00 1.48618378e+02
1716.lowfreq: -10.3656 -6.7271 -0.0005 0.0004 0.0005 3.3085 20.9561 24.8588 39.6970
frequency: 20.6039 24.7979 39.6695 47.8840 55.0438 69.7429 115.0650 126.3574 133.8504 142.7247 158.0692 191.8153 201.4434 212.6625 222.8850 225.5543 231.3926 246.0753 291.9534 356.3318 357.8797 371.6782 376.9143 412.7798 440.3750 465.6245 482.2757 503.6515 597.3021 627.3402 657.8376 685.0504 724.3414 729.0644 750.7942 757.8912 769.1606 780.8393 789.6261 818.1074 881.8711 892.9112 914.2261 924.0224 945.2973 960.0566 966.1960 992.8000 998.4523 1017.8421 1061.9579 1065.8539 1087.2869 1114.5303 1127.7706 1149.7734 1163.8593 1176.7213 1195.7317 1219.8875 1243.2814 1265.3882 1271.2879 1289.4117 1293.9858 1305.2574 1314.3273 1320.3168 1329.2563 1335.5509 1354.9996 1358.2268 1366.0698 1374.7620 1375.5438 1379.4903 1390.2142 1395.9622 1446.8345 1458.5599 1464.3151 1467.8263 1471.5510 1474.1699 1476.8714 1479.5986 1483.8704 1486.1578 1489.7936 1612.9215 1648.8356 1676.7648 2951.6778 2962.5047 2966.2886 2967.8718 2971.0565 2971.8267 2973.4623 2983.8962 3004.8320 3008.3270 3031.0818 3033.2225 3057.4343 3060.4976 3068.8864 3069.1254 3069.8958 3073.8495 3073.9593 3078.3992 3518.2012 3519.9700
redmass: 2.5124 7.6949 3.1969 3.7084 1.6585 4.1358 4.2592 2.7466 2.7407 4.6012 9.5768 3.8028 2.5743 1.1692 1.4337 2.5738 1.8354 1.1615 2.6021 10.1248 3.1080 5.5097 3.1026 2.7229 2.2687 4.7062 8.7568 3.9747 8.2529 4.0125 2.3900 2.5143 4.1900 1.2049 3.1600 1.7526 1.4869 1.3419 1.7518 2.5664 1.6452 1.9232 1.1742 1.5947 1.5951 1.5799 3.7388 3.5397 1.6764 3.0696 3.1615 2.4615 2.0711 2.7280 2.0504 2.4891 2.8080 1.8211 2.8626 1.3887 1.5375 1.3291 1.2499 1.2905 1.4945 1.4903 1.3713 1.3989 1.4684 1.3994 1.4310 1.5271 8.3676 1.8387 1.6289 1.2304 1.2165 1.2136 1.0826 1.0756 1.0734 1.0501 1.0578 1.0683 1.0425 1.0836 1.0569 1.0772 1.0490 6.8731 8.4865 5.5405 1.0824 1.0579 1.0616 1.0362 1.0592 1.0368 1.0367 1.0599 1.0977 1.0614 1.1030 1.0981 1.1018 1.0994 1.0994 1.1005 1.1000 1.0990 1.0990 1.1031 1.0758 1.0781
irintensity: 0.0115 0.5334 0.0941 0.0424 0.0065 0.1575 2.4132 0.3114 0.3610 0.2029 11.7242 0.1269 0.0259 0.0154 0.4133 2.4962 0.2124 0.2410 2.5297 25.0274 0.9474 8.5703 2.1836 1.9314 5.6118 7.0649 17.4371 15.0180 0.4471 4.6677 1.4368 31.1048 12.4525 7.6883 5.6336 4.2656 2.8843 7.1475 202.7558 2.3697 1.8058 6.3879 3.3749 2.1286 1.1287 1.0452 21.8204 3.8521 1.3007 4.4637 1.4888 2.7087 1.5684 16.2512 2.8541 6.1566 20.0296 16.2214 19.2302 3.5485 19.4084 16.0632 14.4740 64.9829 119.1809 93.6601 37.1795 12.8065 18.1784 28.4541 7.5928 5.6403 206.5292 11.5280 4.1248 20.2811 10.4206 13.8586 16.3861 3.0753 0.1413 3.0469 3.4175 5.1453 12.5978 4.3991 7.3773 13.9833 27.7990 284.2822 87.9700 616.7623 15.0831 0.6760 14.2633 32.4627 43.8868 29.4098 41.8666 33.3400 1.4131 23.0968 17.0224 2.4194 9.4919 10.1282 68.8719 72.2061 26.2263 54.8363 69.2508 35.2789 83.4963 43.2850
temp: 298.150 k
press: 1.00000 atm
elementType: 8 8 8 7 7 6 6 6 6 6 6 6 6 6 6 6 6 6 1 1 1 1 1 1 1 1 1 1 1 1 1 1 1 1 1 1 1 1 1 1
symmnumber: 1
zpe: 888748.7 jmol-1
zpe.correction: 0.338506 hartree
zpe.thermalcorrener: 0.358798 hartree
zpe.thermalcorrenthalpy: 0.359742 hartree
zpe.thermalcorrgfe: 0.287609 hartree
zpe.sumelectzpe: -842.401511 hartree
zpe.sumelectthermal: -842.381220 hartree
zpe.sumelectthermalent: -842.380275 hartree
zpe.sumelectthermalfe: -842.452409 hartree
dipole: -1.3537 -0.9377 0.1253
dipole: 1.6515
quadrupole: -106.7897 -118.5362 -119.1272
quadrupole: -3.5345 -1.5585 0.3790
quadrupole: 8.0280 -3.7185 -4.3095 -3.5345 -1.5585 0.3790
hfenergy: -842.7400178 hartree
pointgroup: C01 [X(C13H22N2O3)]
dipole: -0.5410257 -0.3562973 0.0503248 debye
polarizability: 164.4496821|10.9159064|176.0873424|4.3186669|-0.9720851|148.1168268 unknown
InChI: InChI=1S/C13H22N2O3/c1-4-5-7-13(8-6-9(2)3)10(16)14-12(18)15-11(13)17/h9,14-15H,4-8H2,1-3H3
charge 0 multiplicity 1
40 atoms
O  1.148373 0.227923 2.44585
O  0.006407 0.086689 -2.257302
O  1.481391 4.000744 -0.245351
N  1.258096 2.089395 1.084059
N  0.64945 2.032049 -1.195846
C  0.165003 0.001105 0.201232
C  -1.364984 0.068407 0.6391
C  0.657433 -1.472616 0.126484
C  -2.343804 -0.75171 -0.228949
C  -3.833321 -0.442329 0.091353
C  2.160835 -1.626158 -0.193087
C  0.91139 0.744863 1.324018
C  0.281305 0.66965 -1.176315
C  2.590024 -3.110005 -0.260713
C  -4.207567 -0.795758 1.551405
C  -4.753171 -1.192249 -0.900941
C  1.145816 2.796522 -0.125887
C  4.088608 -3.283472 -0.587126
H  -1.392887 -0.285961 1.686424
H  -1.685706 1.131217 0.646244
H  0.067923 -1.986602 -0.652787
H  0.434884 -1.950385 1.099052
H  -2.158149 -0.550354 -1.300948
H  -2.169194 -1.834894 -0.074026
H  -3.99155 0.648896 -0.051323
H  2.389471 -1.143812 -1.165488
H  2.76763 -1.113525 0.58029
H  1.980101 -3.630297 -1.026953
H  2.361877 -3.599093 0.708053
H  1.670129 2.609938 1.865554
H  0.629249 2.504202 -2.105954
H  -3.62822 -0.208086 2.286407
H  -4.021802 -1.869188 1.751071
H  -5.279267 -0.599311 1.739389
H  -4.627881 -2.28763 -0.798835
H  -5.817141 -0.956478 -0.713432
H  -4.522466 -0.921956 -1.94813
H  4.720476 -2.797958 0.180328
H  4.336442 -2.827561 -1.56423
H  4.371402 -4.351112 -0.630987
