program: Gaussian 09
title: 000245604
version: EM64L-G09RevD.01
frameworkgroup: C1[X(C12H17NO2)]
method: RPBEPBE
basis: SDD
operation: Freq
keyword: #p
keyword: freq=noraman
keyword: PBEPBE/SDD
title: #p freq=noraman PBEPBE/SDD
converged: YES YES NO NO
title: Mulliken charges:
elementType: O O N C C C C C C C C C C C C H H H H H H H H H H H H H H H H H
charge: -0.321538 -0.269194 -0.479055 0.131127 0.340822 0.365899 0.055272 -0.419483 -0.412147 -0.233040 -0.833432 -0.828408 -0.683730 -0.686760 0.255978 0.231565 0.325540 0.232010 0.232082 0.225155 0.224647 0.244401 0.235284 0.285001 0.222510 0.217190 0.211593 0.255451 0.214824 0.208167 0.231950 0.220319
chargesum: 0.00000
title: Mulliken charges with hydrogens summed into heavy atoms:
elementType: O O N C C C C C C C C C C C C
charge: -0.321538 -0.269194 -0.153515 0.131127 0.340822 0.365899 0.286837 -0.187473 -0.180064 -0.007885 -0.129100 -0.103707 -0.001861 -0.026324 0.255978
polarizability: 1.96398197e+02 4.31436568e-01 1.45974206e+02 8.08806850e+00 -3.50481056e+00 9.46613100e+01
1716.lowfreq: -3.3305 -0.0004 0.0005 0.0008 4.7296 9.3691 34.1375 44.3710 64.2211
frequency: 33.9198 44.3232 64.2080 88.6696 100.8041 136.6374 160.8280 178.4966 200.8086 203.6739 229.1284 230.9787 251.2849 295.8204 312.7643 314.7948 370.8871 395.2192 447.3759 466.0123 514.1583 515.7988 533.2771 544.5082 599.3467 673.1108 688.9428 707.1715 743.4066 777.6454 789.9649 858.9882 895.7751 898.6802 924.7304 929.6513 940.7068 974.0322 981.4879 990.6717 1040.3311 1045.7444 1053.1899 1098.5482 1105.3043 1154.1812 1159.5187 1177.2620 1185.7468 1232.1503 1260.7932 1281.4525 1320.6476 1339.4705 1369.8085 1378.1532 1394.4376 1399.4021 1400.5539 1435.8321 1454.3906 1457.6552 1459.0234 1464.9345 1470.6291 1472.8354 1479.9693 1487.9633 1488.4084 1495.7579 1604.5237 1605.0851 1666.6829 2961.9578 2979.6729 2986.4598 2991.3042 3024.6645 3040.2773 3062.0081 3081.6259 3087.1366 3088.3691 3092.0072 3096.4577 3101.8319 3120.8056 3130.9246 3156.1758 3531.8783
redmass: 2.8623 3.6637 4.2412 5.1432 4.5075 3.6645 1.0671 1.3531 1.0837 2.0170 2.5665 2.2869 1.3180 4.1492 3.4549 2.8663 3.4016 3.0794 2.6323 2.9503 4.0699 3.1907 4.7627 3.3756 1.3485 5.5859 5.3860 6.9045 4.1882 1.2269 4.3271 4.1534 2.7896 1.3101 1.2512 2.5469 1.3734 1.3865 2.9204 2.1565 1.6577 1.6677 1.6041 1.6885 1.8619 2.4009 2.4820 1.1812 1.9908 3.2576 1.6914 2.4646 1.4063 1.3168 6.4936 1.2627 1.2314 1.2386 1.2628 1.9909 1.7627 1.0712 1.1192 1.0509 1.0861 1.0626 1.3944 1.0601 1.3075 1.6433 6.4333 6.0390 8.4158 1.0419 1.0364 1.0356 1.0358 1.0864 1.0925 1.0969 1.0993 1.0998 1.0982 1.0988 1.1005 1.1006 1.0856 1.0919 1.0995 1.0755
irintensity: 0.0608 1.1208 0.8971 1.8713 3.0926 3.0619 0.6622 1.8595 0.6253 4.9028 4.0947 1.1768 3.8586 7.2035 0.9119 4.5092 1.9610 8.0603 2.6974 2.2058 0.2399 1.1386 2.6707 10.2255 80.4578 0.7289 6.0593 40.4232 5.2251 55.0674 5.0094 2.4669 2.1085 0.2146 4.9711 11.1139 0.9419 14.0478 209.6897 23.0866 5.9344 5.5358 14.3343 0.6390 217.9331 135.3308 231.7763 5.6928 3.2334 26.4162 6.4345 10.9274 9.1949 8.6761 27.1416 33.9925 25.3488 33.5815 2.0137 32.0748 38.8258 10.3588 26.8912 4.6633 12.9678 12.3582 148.2523 18.8164 34.6347 224.0879 8.2779 5.4862 214.5042 33.9063 24.1117 16.5660 26.6210 6.8716 20.1961 11.0788 8.4459 20.5632 23.1125 55.0264 19.5878 32.8007 0.4239 26.1267 33.2755 26.6610
temp: 298.150 k
press: 1.00000 atm
elementType: 8 8 7 6 6 6 6 6 6 6 6 6 6 6 6 1 1 1 1 1 1 1 1 1 1 1 1 1 1 1 1 1
symmnumber: 1
zpe: 699711.5 jmol-1
zpe.correction: 0.266506 hartree
zpe.thermalcorrener: 0.282682 hartree
zpe.thermalcorrenthalpy: 0.283627 hartree
zpe.thermalcorrgfe: 0.222740 hartree
zpe.sumelectzpe: -671.567427 hartree
zpe.sumelectthermal: -671.551251 hartree
zpe.sumelectthermalent: -671.550307 hartree
zpe.sumelectthermalfe: -671.611193 hartree
dipole: -0.8192 1.5656 -1.5775
dipole: 2.3687
quadrupole: -76.8055 -84.0739 -94.6811
quadrupole: 0.3937 0.8823 1.2209
quadrupole: 8.3813 1.1129 -9.4943 0.3937 0.8823 1.2209
hfenergy: -671.8339334 hartree
pointgroup: C01 [X(C12H17N1O2)]
dipole: 0.3435878 0.4271626 0.7536456 debye
polarizability: 196.1680865|-4.67267|141.3584822|7.9518167|15.1874418|99.5071449 unknown
InChI: InChI=1S/C12H17NO2/c1-8(2)15-12(14)13-11-9(3)6-5-7-10(11)4/h5-8,13H,1-4H3
charge 0 multiplicity 1
32 atoms
O  2.418334 0.031013 0.606221
O  1.173717 -0.653489 -1.283527
N  0.162785 0.172695 0.694795
C  -1.227911 0.142853 0.333811
C  -1.973561 1.350763 0.48709
C  -1.847107 -1.063903 -0.105523
C  3.696402 -0.244376 -0.13495
C  -3.352482 1.341296 0.173979
C  -3.227361 -1.02122 -0.427833
C  -3.978328 0.164836 -0.292795
C  -1.299622 2.624415 0.96761
C  -1.085265 -2.369349 -0.2038
C  4.032171 0.958587 -1.028449
C  4.738649 -0.522595 0.951103
C  1.225879 -0.195482 -0.115013
H  3.519817 -1.138868 -0.761229
H  0.428435 0.638729 1.565376
H  -3.931619 2.265606 0.284227
H  -3.715569 -1.940551 -0.771967
H  -5.045231 0.171193 -0.541843
H  -1.003794 2.565736 2.035079
H  -0.383127 2.841083 0.387954
H  -1.979487 3.487107 0.868977
H  -0.421521 -2.371713 -1.087159
H  -0.437336 -2.523316 0.679457
H  -1.780397 -3.222861 -0.277948
H  4.979887 0.776457 -1.568056
H  3.237746 1.120412 -1.776454
H  4.148675 1.873251 -0.419809
H  5.712756 -0.759589 0.486164
H  4.433168 -1.376931 1.579121
H  4.869193 0.360308 1.60179
