program: Gaussian 09
title: 000245633
version: EM64L-G09RevD.01
frameworkgroup: C1[X(C11H10N2O7)]
method: RPBEPBE
basis: SDD
operation: Freq
keyword: #p
keyword: freq=noraman
keyword: PBEPBE/SDD
title: #p freq=noraman PBEPBE/SDD
converged: YES YES NO NO
title: Mulliken charges:
elementType: O O O O O O O N N C C C C C C C C C C C H H H H H H H H H H
charge: -0.247248 -0.213561 -0.177072 -0.186364 -0.195500 -0.187735 -0.224401 0.023511 0.016459 0.425095 0.092924 0.362972 -0.582270 0.465194 -0.540154 -0.773240 0.306950 -0.368926 -0.044656 -0.514656 0.302372 0.337811 0.259411 0.249252 0.230313 0.240794 0.245977 0.237353 0.225975 0.233419
chargesum: 0.00000
title: Mulliken charges with hydrogens summed into heavy atoms:
elementType: O O O O O O O N N C C C C C C C C C C C
charge: -0.247248 -0.213561 -0.177072 -0.186364 -0.195500 -0.187735 -0.224401 0.023511 0.016459 0.425095 0.092924 0.362972 -0.279898 0.465194 -0.202344 -0.034264 0.306950 0.117845 0.192697 -0.055262
polarizability: 2.39422195e+02 1.30898960e+00 1.70192188e+02 -1.57540870e+01 8.10767611e+00 1.06980680e+02
1716.lowfreq: -7.6360 -4.2116 -1.7703 -0.0005 0.0002 0.0008 24.0044 25.5654 40.5697
frequency: 23.9954 25.5331 40.5617 53.8464 56.8359 62.8058 96.9373 109.4017 115.7216 136.8767 148.0451 165.3612 211.6509 218.1278 233.4562 268.2764 322.7579 332.5056 342.7325 352.0446 371.9505 405.8083 447.7787 466.5036 487.0779 524.7310 546.7373 590.4284 642.1090 646.5923 671.5008 678.2478 683.4556 717.6350 732.7356 750.3391 774.9472 824.0020 882.8939 914.9001 933.1118 936.1472 958.3764 960.2872 970.0948 979.3644 1002.6967 1008.7115 1055.4596 1086.9866 1106.5355 1164.5497 1177.0308 1196.8904 1207.2898 1226.1122 1247.1578 1259.6640 1289.2140 1343.0335 1369.9808 1373.3521 1395.1232 1407.7777 1415.4614 1428.0750 1456.0816 1458.1366 1462.4767 1477.3545 1596.0909 1603.6969 1658.0337 1671.2269 2996.0390 3045.1514 3076.7301 3097.9162 3109.1214 3115.1206 3131.7176 3178.1167 3192.2302 3209.5353
redmass: 6.4181 4.8506 8.7089 8.4076 5.9398 4.1207 5.7981 1.0546 2.9996 6.6568 11.5356 11.2398 5.2677 3.5737 6.5372 4.3294 6.8845 6.1668 10.2491 3.4624 6.4993 2.4084 6.3770 4.2366 4.7055 4.9095 5.6621 5.0486 3.7565 6.2069 5.9386 7.1820 4.3977 6.4094 12.3242 5.7977 6.1601 7.2161 7.2861 1.7450 3.1553 1.7474 3.6730 1.4793 2.2807 1.2957 1.2197 1.5333 1.5571 1.8184 4.6154 2.0953 4.1867 3.5116 3.8481 7.6827 1.2251 2.8701 1.2408 1.2282 9.7914 9.5441 3.6215 1.3644 4.3719 1.1573 1.1501 1.0488 3.9521 1.2641 9.4087 6.8844 4.7476 10.1322 1.0372 1.0579 1.0970 1.0604 1.1006 1.1008 1.1032 1.0927 1.0923 1.1153
irintensity: 0.5207 0.0605 1.1341 0.4565 0.4513 0.0551 1.2278 0.1739 0.1109 5.5847 3.3390 2.0502 1.3900 1.7883 1.2872 15.8693 9.3015 11.9814 0.7898 2.9378 5.1990 2.0804 2.4313 0.4324 6.7927 0.4482 0.7763 0.9875 7.3244 7.1501 3.9887 14.7325 68.0824 5.8033 29.0677 10.7479 7.7487 151.1579 23.4551 29.1313 6.0244 13.7003 19.1209 26.6334 4.6774 100.5125 27.0381 10.4742 13.9814 478.5189 1081.6652 8.9346 62.1311 288.3793 167.9019 78.3330 33.2239 25.8424 1.0830 7.9307 127.3157 51.0001 1.3103 29.7251 17.0783 12.2681 23.7041 17.7917 100.3234 39.3517 19.0491 41.9313 16.5748 174.4504 9.0772 20.7022 7.7462 4.4778 13.0608 2.6283 11.8581 3.6157 24.2852 18.4420
temp: 298.150 k
press: 1.00000 atm
elementType: 8 8 8 8 8 8 8 7 7 6 6 6 6 6 6 6 6 6 6 6 1 1 1 1 1 1 1 1 1 1
symmnumber: 1
zpe: 538984.1 jmol-1
zpe.correction: 0.205288 hartree
zpe.thermalcorrener: 0.224640 hartree
zpe.thermalcorrenthalpy: 0.225584 hartree
zpe.thermalcorrgfe: 0.154654 hartree
zpe.sumelectzpe: -1059.572373 hartree
zpe.sumelectthermal: -1059.553022 hartree
zpe.sumelectthermalent: -1059.552078 hartree
zpe.sumelectthermalfe: -1059.623008 hartree
dipole: 5.1998 -4.5045 -0.6638
dipole: 6.9116
quadrupole: -120.4796 -116.0832 -115.9552
quadrupole: -0.7326 9.2961 0.3873
quadrupole: -2.9736 1.4228 1.5508 -0.7326 9.2961 0.3873
hfenergy: -1059.7776615 hartree
pointgroup: C01 [X(C11H10N2O7)]
dipole: -2.1627442 1.3880211 -0.888858 debye
polarizability: 237.7656034|13.4795733|157.9888265|16.4240004|-26.136269|120.8406334 unknown
InChI: InChI=1S/C11H10N2O7/c1-3-4-19-11(14)20-10-7(2)5-8(12(15)16)6-9(10)13(17)18/h3,5-6H,1,4H2,2H3
charge 0 multiplicity 1
30 atoms
O  -1.179032 0.212756 -0.972004
O  -3.294219 -0.446161 -0.790744
O  0.837696 -2.820718 1.335758
O  -0.88049 -2.392131 -0.09289
O  4.854968 1.851153 0.17207
O  4.841933 -0.189745 1.194339
O  -2.073223 -0.106948 1.193409
N  0.21883 -2.062819 0.499707
N  4.271194 0.757844 0.532735
C  0.841996 1.466397 -0.925364
C  0.151384 0.279029 -0.541773
C  0.836687 -0.752964 0.165254
C  2.197286 1.604174 -0.572093
C  2.844946 0.583351 0.157093
C  2.187138 -0.595095 0.53366
C  0.106898 2.549292 -1.684168
C  -2.20081 -0.147143 -0.040419
C  -4.55456 -0.737603 0.003822
C  -5.291061 0.540648 0.304277
C  -5.502651 0.995707 1.564286
H  2.7593 2.501852 -0.843363
H  2.704034 -1.382086 1.087938
H  -0.285216 2.166374 -2.642904
H  -0.76578 2.911364 -1.111649
H  0.770615 3.404266 -1.889596
H  -5.109095 -1.395548 -0.68337
H  -4.270327 -1.280037 0.920773
H  -5.670853 1.097837 -0.562537
H  -6.06343 1.917999 1.752178
H  -5.117958 0.459854 2.440075
