program: Gaussian 09
title: 000245606
version: EM64L-G09RevD.01
frameworkgroup: C1[X(C12H22O3)]
method: RPBEPBE
basis: SDD
operation: Freq
keyword: #pfreq=noraman
keyword: PBEPBE/SDD
title: #p freq=noraman PBEPBE/SDD
converged: YES YES NO NO
title: Mulliken charges:
elementType: O O O C C C C C C C C C C C C H H H H H H H H H H H H H H H H H H H H H H
charge: -0.248406 -0.190095 -0.249725 -0.359911 -0.374212 -0.353326 -0.511446 -0.355587 0.197886 -0.695834 -0.605452 0.270171 -0.274984 -0.359032 -0.679584 0.183642 0.191316 0.209924 0.217301 0.189742 0.189960 0.283369 0.229132 0.193980 0.195021 0.210316 0.215117 0.210255 0.274133 0.239971 0.221333 0.228310 0.232912 0.219308 0.210245 0.216529 0.227718
chargesum: 0.00000
title: Mulliken charges with hydrogens summed into heavy atoms:
elementType: O O O C C C C C C C C C C C C
charge: -0.248406 -0.190095 -0.249725 0.015047 0.053013 0.026376 0.001055 0.033415 0.197886 -0.060146 -0.091348 0.270171 0.174659 0.093188 -0.025092
polarizability: 1.73181993e+02 3.40266834e+00 1.27904072e+02 6.24799196e-01 -2.60980150e+00 1.22704104e+02
1716.lowfreq: -16.4642 -5.6342 -0.0007 0.0001 0.0007 2.8832 11.9268 25.6225 31.2538
frequency: 10.3906 25.1307 31.1730 46.1996 56.2280 65.7827 68.7900 81.2933 93.2836 112.1944 133.6167 160.9290 179.7532 218.3073 224.3271 238.8459 276.9753 287.3878 306.0055 348.5645 415.9352 447.8204 462.6450 494.1099 546.2470 643.1915 687.3931 720.5945 735.2856 759.1441 780.3511 810.1313 831.4129 877.2334 885.2213 890.5893 898.4768 925.4156 956.6390 977.9599 1012.0258 1033.4320 1046.3528 1067.6812 1070.8291 1082.7747 1099.3243 1116.4018 1123.2456 1133.4062 1161.2745 1188.6602 1210.3624 1230.8425 1243.7158 1247.4225 1269.1297 1279.6613 1287.7973 1289.5109 1291.5106 1294.8781 1307.9802 1335.3737 1355.4682 1362.6519 1367.9050 1390.1921 1394.6553 1430.7708 1438.1416 1452.4841 1461.9529 1463.8996 1472.5307 1476.6862 1478.3146 1480.8607 1481.3528 1487.5807 1488.5501 1618.0478 1640.9259 2949.4297 2951.1120 2956.4805 2967.0808 2972.3244 2980.2128 2987.5183 2989.7970 2997.9727 3003.7343 3005.2376 3020.7094 3022.8218 3029.9346 3051.4243 3053.7227 3069.0072 3070.6632 3077.8202 3084.5456 3106.7266 3126.8196
redmass: 3.9451 2.4126 3.2267 2.8650 3.3816 4.9002 2.3632 2.4854 2.8156 1.9424 2.3833 2.9619 4.0703 4.2749 1.1639 1.1064 3.0025 3.1764 3.7866 3.0532 4.0518 3.1613 2.5868 2.9652 5.4921 4.0058 2.7828 1.1220 1.2461 1.1396 1.5653 2.5867 2.8075 1.6164 1.3483 1.8991 1.5946 2.1759 4.2473 1.2647 3.6095 3.2902 3.0118 1.9044 2.6372 2.0889 1.5199 2.4788 2.4000 2.9242 1.6893 1.6659 1.4811 1.3509 1.3207 1.2530 1.3556 1.1958 1.1521 1.2419 1.1181 1.1480 1.3296 1.5058 1.6419 1.7306 1.3916 1.2167 1.2037 1.0912 1.0960 1.1005 1.0692 1.0733 1.0739 1.0518 1.0423 1.0423 1.0775 1.0827 1.0886 8.7397 8.4052 1.0624 1.0594 1.0587 1.0589 1.0364 1.0359 1.0962 1.0609 1.0942 1.0602 1.1010 1.0622 1.0582 1.1040 1.1010 1.1032 1.1006 1.0993 1.1019 1.0990 1.1082 1.1000
irintensity: 0.4760 0.4297 1.9688 1.0269 1.2153 1.7149 0.6744 1.3902 1.5135 0.3985 0.4751 0.9264 4.2841 3.5547 0.1175 0.0027 4.9467 9.2954 5.4914 3.9128 5.4466 0.1646 8.7717 3.6199 9.8122 6.3799 6.0467 13.2364 3.4903 7.0168 0.8897 10.1661 1.0997 5.8255 3.7544 2.4279 12.2789 19.8360 48.3738 1.8915 1.1885 8.7433 10.4322 89.5374 0.6221 1.7191 7.0920 133.1273 6.4750 275.1033 4.5594 6.9444 40.1958 40.8957 4.8413 9.0983 89.8644 43.8925 3.7627 7.2413 8.1058 5.9235 8.9495 12.5187 6.2232 23.9460 2.7219 10.6704 10.0352 26.6296 29.8009 12.5488 0.1361 0.7799 2.8563 4.5069 12.3202 12.6862 3.4036 17.3654 23.5674 230.7627 58.0582 6.8828 10.4404 8.2291 89.3444 35.0441 34.2821 2.5472 33.1748 1.3492 7.8556 0.8859 4.5992 47.6776 36.8576 0.5431 62.1919 93.8538 55.2975 32.8835 36.7243 37.2213 2.7577
temp: 298.150 k
press: 1.00000 atm
elementType: 8 8 8 6 6 6 6 6 6 6 6 6 6 6 6 1 1 1 1 1 1 1 1 1 1 1 1 1 1 1 1 1 1 1 1 1 1
symmnumber: 1
zpe: 839495.2 jmol-1
zpe.correction: 0.319747 hartree
zpe.thermalcorrener: 0.338816 hartree
zpe.thermalcorrenthalpy: 0.339760 hartree
zpe.thermalcorrgfe: 0.267704 hartree
zpe.sumelectzpe: -694.931124 hartree
zpe.sumelectthermal: -694.912055 hartree
zpe.sumelectthermalent: -694.911111 hartree
zpe.sumelectthermalfe: -694.983166 hartree
dipole: 1.1590 0.5176 -1.6081
dipole: 2.0487
quadrupole: -80.3876 -89.7771 -101.2617
quadrupole: 4.5626 0.9025 7.9593
quadrupole: 10.0879 0.6984 -10.7862 4.5626 0.9025 7.9593
hfenergy: -695.2508705 hartree
pointgroup: C01 [X(C12H22O3)]
dipole: 0.4472153 -0.0869999 -0.6649253 debye
polarizability: 173.3736295|-1.4133285|125.2328184|-1.197216|-3.5924088|125.1837219 unknown
InChI: InChI=1S/C12H22O3/c1-3-5-6-7-8-11(13)10-12(14)15-9-4-2/h3-10H2,1-2H3
charge 0 multiplicity 1
37 atoms
O  3.455561 -1.607028 0.315054
O  0.062768 -1.66384 2.378395
O  1.83525 -1.189481 -1.314572
C  -3.251044 -0.481099 -0.279815
C  -2.120165 -0.735219 0.741453
C  -4.357925 0.449657 0.263792
C  -1.014095 -1.643629 0.175487
C  -5.494862 0.705625 -0.751903
C  0.103496 -1.962612 1.158759
C  -6.594472 1.64025 -0.20322
C  1.339225 -2.701207 0.580854
C  2.198257 -1.761973 -0.258169
C  4.39541 -0.66381 -0.373256
C  4.168885 0.776905 0.103766
C  5.20157 1.738758 -0.525291
H  -3.703818 -1.450152 -0.579374
H  -2.823507 -0.039289 -1.204362
H  -1.674419 0.229372 1.053864
H  -2.535354 -1.188845 1.661755
H  -4.786484 0.010758 1.189091
H  -3.908657 1.420402 0.560736
H  -0.550625 -1.21041 -0.735322
H  -1.443481 -2.614183 -0.159084
H  -5.945176 -0.264606 -1.046212
H  -5.064988 1.141508 -1.677016
H  -6.17569 2.627633 0.068753
H  -7.394845 1.806245 -0.947749
H  -7.060685 1.213275 0.704902
H  1.933868 -3.113762 1.408458
H  0.989774 -3.513899 -0.082779
H  5.392385 -1.037861 -0.087908
H  4.249216 -0.751806 -1.465136
H  3.145281 1.092162 -0.169696
H  4.241814 0.808442 1.206891
H  6.235517 1.457847 -0.250208
H  5.130685 1.739171 -1.628908
H  5.031032 2.772898 -0.17783
