program: Gaussian 09
title: 000245601
version: EM64L-G09RevD.01
frameworkgroup: C1[X(C11H20O3)]
method: RPBEPBE
basis: SDD
operation: Freq
keyword: #pfreq=noraman
keyword: PBEPBE/SDD
title: #p freq=noraman PBEPBE/SDD
converged: YES YES NO NO
title: Mulliken charges:
elementType: O O O C C C C C C C C C C C H H H H H H H H H H H H H H H H H H H H
charge: -0.190160 -0.252433 -0.251200 -0.360246 -0.374439 -0.353174 -0.511958 -0.355719 0.198416 -0.695749 -0.600012 0.277507 -0.267414 -0.658762 0.183413 0.191563 0.210228 0.217622 0.189678 0.190198 0.283654 0.228946 0.193924 0.195052 0.210211 0.210364 0.215090 0.274074 0.240013 0.236188 0.226198 0.217668 0.247188 0.234073
chargesum: 0.00000
title: Mulliken charges with hydrogens summed into heavy atoms:
elementType: O O O C C C C C C C C C C C
charge: -0.190160 -0.252433 -0.251200 0.014730 0.053411 0.026701 0.000641 0.033258 0.198416 -0.060084 -0.085926 0.277507 0.194972 0.040167
polarizability: 1.62596958e+02 3.81518002e+00 1.14800689e+02 1.86930195e+00 -2.85376189e+00 1.12834448e+02
1716.lowfreq: -14.9530 -6.7962 -0.0004 0.0008 0.0008 5.2984 9.2102 20.5781 28.6955
frequency: -5.7594 19.3476 28.5635 49.1336 57.0368 72.2369 78.7321 97.4839 112.5690 134.0022 166.3350 176.8458 197.4054 228.7417 231.0693 288.0678 313.8397 359.2128 413.0134 436.0322 450.3579 484.4745 547.5886 628.6804 685.2887 720.6861 733.9227 763.8449 794.5522 811.4377 833.7882 871.3014 890.1719 901.2110 929.6327 977.3647 1008.8613 1012.3256 1034.5277 1068.6758 1070.2761 1082.1305 1096.1855 1100.3257 1119.1186 1133.0349 1156.9614 1187.9853 1208.8595 1230.1627 1242.5877 1268.4353 1276.7390 1279.7930 1286.4550 1287.7830 1294.0055 1334.4223 1354.1316 1354.9401 1362.1459 1387.8746 1393.3659 1430.1695 1438.4075 1457.4502 1461.5768 1463.1599 1463.7626 1471.7087 1476.4868 1480.0598 1484.0462 1487.3394 1619.4990 1641.7668 2946.8296 2950.5623 2956.1595 2967.4479 2971.6434 2988.0528 2989.6468 2995.2994 2997.2383 3005.0430 3019.4963 3029.7717 3031.8456 3054.1639 3068.3626 3070.7420 3090.8092 3095.6314 3121.8013 3125.1105
redmass: 2.3451 2.4970 4.1066 4.1037 3.3575 2.9958 3.6958 2.3504 2.2759 2.2206 3.4325 3.0794 1.8296 1.1221 2.2747 2.7407 3.1103 3.0877 4.1294 2.7875 2.5046 2.8872 5.0137 3.6040 2.7978 1.1288 1.2620 1.8353 1.7957 1.3650 2.7775 1.6689 1.8849 2.2371 2.3591 1.2554 2.6946 3.6884 3.3025 1.9080 2.6524 2.0820 2.1400 1.5082 2.5740 3.1062 1.6598 1.6654 1.4863 1.3557 1.3421 1.3427 1.1268 1.2376 1.1099 1.2773 1.1663 1.5077 1.3705 1.5364 1.7518 1.2173 1.2299 1.0917 1.0953 1.0951 1.0707 1.0453 1.0726 1.0741 1.0426 1.0779 1.0515 1.0873 8.5581 8.4393 1.0630 1.0593 1.0588 1.0592 1.0364 1.0922 1.0651 1.0361 1.0941 1.1014 1.0623 1.1041 1.0596 1.1032 1.1008 1.0993 1.0976 1.1029 1.1064 1.0999
irintensity: 0.6442 0.7479 1.3222 3.2066 0.5585 1.1978 2.1108 0.3805 0.7729 0.7389 0.7811 3.1477 8.8388 0.0037 0.3807 6.4609 8.9927 4.1938 2.4361 7.9874 4.4593 0.3315 9.8594 7.1346 7.2066 11.9251 4.1317 3.5086 8.9665 4.0858 1.3517 2.8201 3.1431 12.8892 5.9418 0.7260 52.6722 4.0650 12.0704 97.6379 0.5484 2.9144 39.7388 5.5057 74.5237 295.1226 13.5902 5.3839 40.8100 40.2159 5.9849 83.4126 11.2219 51.8097 3.8378 5.9582 7.8398 13.2119 6.1428 3.6066 24.6132 10.7406 22.5116 28.2009 27.9090 17.5532 0.2679 14.4423 0.6468 2.8482 12.3351 3.8761 13.1175 22.6136 229.4487 59.5822 8.9142 8.6860 9.5427 85.5835 36.3814 7.1917 29.7337 16.1796 1.6701 1.0289 4.4672 34.4752 32.0515 57.9315 101.3975 54.3188 33.2047 1.7382 30.8478 3.1687
temp: 298.150 k
press: 1.00000 atm
elementType: 8 8 8 6 6 6 6 6 6 6 6 6 6 6 1 1 1 1 1 1 1 1 1 1 1 1 1 1 1 1 1 1 1 1
symmnumber: 1
zpe: 765413.7 jmol-1
zpe.correction: 0.291531 hartree
zpe.thermalcorrener: 0.308347 hartree
zpe.thermalcorrenthalpy: 0.309291 hartree
zpe.thermalcorrgfe: 0.244034 hartree
zpe.sumelectzpe: -655.708073 hartree
zpe.sumelectthermal: -655.691257 hartree
zpe.sumelectthermalent: -655.690313 hartree
zpe.sumelectthermalfe: -655.755570 hartree
dipole: 1.1831 0.6537 -1.6396
dipole: 2.1250
quadrupole: -73.3226 -85.4069 -92.0736
quadrupole: 5.4441 0.2297 8.7164
quadrupole: 10.2784 -1.8058 -8.4726 5.4441 0.2297 8.7164
hfenergy: -655.9996039 hartree
pointgroup: C01 [X(C11H20O3)]
dipole: 0.4458223 -0.2245702 -0.6706288 debye
polarizability: 162.9106878|-1.2120376|111.0652353|-0.8559502|-1.6866685|116.2561713 unknown
InChI: InChI=1S/C11H20O3/c1-3-5-6-7-8-10(12)9-11(13)14-4-2/h3-9H2,1-2H3
charge 0 multiplicity 1
34 atoms
O  0.560433 -1.078735 2.355493
O  3.898323 -1.043803 0.168062
O  2.17009 -0.803134 -1.384506
C  -2.957612 -0.531599 -0.24575
C  -1.758323 -0.536797 0.727466
C  -4.121946 0.362983 0.23638
C  -0.593843 -1.404389 0.21635
C  -5.332657 0.360622 -0.724385
C  0.581885 -1.512964 1.176759
C  -6.48897 1.26088 -0.237752
C  1.854228 -2.209206 0.627833
C  2.618583 -1.288834 -0.317647
C  4.754583 -0.108613 -0.634515
C  4.500921 1.340689 -0.213421
H  -3.328243 -1.569809 -0.381871
H  -2.623094 -0.187399 -1.246872
H  -1.39841 0.498909 0.884246
H  -2.079034 -0.900053 1.72257
H  -4.452021 0.026824 1.241574
H  -3.756943 1.403751 0.362229
H  -0.202741 -1.037424 -0.75556
H  -0.944378 -2.440366 0.010166
H  -5.698757 -0.679393 -0.846854
H  -5.000783 0.693349 -1.729224
H  -6.857443 0.931549 0.75227
H  -6.157563 2.311857 -0.138119
H  -7.342784 1.240888 -0.939906
H  2.500921 -2.502165 1.467405
H  1.551922 -3.101965 0.049281
H  4.535632 -0.26518 -1.705287
H  5.779299 -0.437464 -0.40007
H  5.202372 2.010297 -0.744808
H  3.472875 1.650071 -0.465921
H  4.656277 1.468025 0.871485
