program: Gaussian 09
title: 000245610
version: EM64L-G09RevD.01
frameworkgroup: C1[X(C19H21NO3)]
method: RPBEPBE
basis: SDD
operation: Freq
keyword: #p
keyword: freq=noraman
keyword: PBEPBE/SDD
title: #p freq=noraman PBEPBE/SDD
converged: YES YES NO NO
title: Mulliken charges:
elementType: O O O N C C C C C C C C C C C C C C C C C C C H H H H H H H H H H H H H H H H H H H H H
charge: -0.291435 -0.279271 -0.267564 -0.036057 -0.092476 -0.596240 -0.613512 0.554044 0.488294 -0.518035 -0.449256 -0.385401 -0.371352 -0.167717 0.216549 -0.338137 0.209147 -0.366221 -0.364092 0.321430 -0.522465 -0.536472 -0.538320 0.263457 0.204188 0.254069 0.235360 0.218686 0.264587 0.226359 0.228693 0.241908 0.235977 0.249678 0.242571 0.217254 0.253792 0.228684 0.219884 0.225601 0.244376 0.220542 0.223979 0.244915
chargesum: 0.00000
title: Mulliken charges with hydrogens summed into heavy atoms:
elementType: O O O N C C C C C C C C C C C C C C C C C C C
charge: -0.291435 -0.279271 -0.267564 -0.036057 0.170981 -0.137983 -0.159466 0.554044 0.488294 -0.253448 -0.222896 -0.156708 -0.129444 -0.167717 0.216549 -0.102160 0.209147 -0.116543 -0.121521 0.321430 0.177264 0.153389 0.151117
polarizability: 2.85919247e+02 2.25070632e+01 2.14300850e+02 -1.04037438e+01 1.59608481e+01 1.66712165e+02
1716.lowfreq: -12.1729 -3.1556 -0.0011 -0.0008 -0.0006 1.9950 9.1488 16.7148 30.6836
frequency: 7.8553 16.1677 30.4801 32.7272 55.6053 58.6609 74.2248 93.7715 97.4066 121.8111 136.0369 145.3815 163.7622 186.3307 196.6325 221.9873 235.2268 239.5927 253.5900 270.1600 284.9876 316.8167 334.9764 349.1129 373.2436 385.8350 413.7573 425.7831 456.5834 483.0712 500.8295 502.3481 518.4993 546.7314 592.1168 626.5153 631.3550 639.3115 689.7863 709.9488 722.4714 739.1934 746.9182 779.9211 803.2313 812.0847 820.2658 841.7133 878.2591 897.1249 903.8119 922.9558 939.1082 946.3524 959.7496 984.0012 987.8059 992.4919 1003.4577 1024.2692 1040.8433 1111.4297 1111.6081 1112.8356 1113.0482 1115.8469 1143.1475 1156.4177 1156.8556 1163.3766 1176.6893 1181.3790 1199.4296 1202.6300 1210.0435 1226.5473 1234.2151 1255.2667 1276.7238 1306.9618 1308.9999 1316.4170 1340.7653 1380.2554 1383.5811 1404.2379 1418.6015 1432.7299 1436.8265 1442.2794 1457.1043 1463.6806 1466.9998 1467.5805 1471.5772 1473.7643 1474.4474 1481.4884 1497.9214 1502.6109 1579.8056 1583.4819 1616.7210 1623.2481 2185.8713 2959.7811 2960.0385 2975.1659 2978.7552 2993.9760 2994.5273 3047.8726 3048.5157 3049.1082 3067.5252 3080.9575 3118.5539 3119.0287 3124.0691 3124.7045 3125.2715 3134.5648 3152.0111 3160.0517 3163.3906 3166.8834
redmass: 4.3542 4.9614 5.5544 4.1237 4.9464 4.5131 2.3071 4.6778 4.0139 3.3072 2.2822 4.2663 2.3635 3.3539 3.7773 2.6396 1.3303 2.9322 1.3200 3.6402 3.6193 3.3879 2.7400 3.6618 3.8261 4.2405 2.9504 5.3465 4.3531 3.7317 4.5492 3.8755 3.0605 4.7578 4.2857 4.2382 6.4309 4.3393 3.9895 5.4220 4.2467 3.6531 3.9832 3.0729 1.8487 2.0490 1.3838 1.9328 2.5170 3.1235 1.6169 1.3733 1.5103 2.0828 1.3572 6.9197 8.4432 4.5996 2.6805 2.2946 2.8321 1.2792 1.6518 1.6095 1.2601 1.3580 1.5210 1.3730 1.3435 1.2614 1.4468 1.2678 1.4854 1.3120 1.9369 1.5472 2.9985 2.6529 1.7537 1.3087 1.4349 1.4463 1.5027 6.4542 4.7225 2.1217 3.1589 1.2331 1.1701 1.3908 1.0682 1.0993 1.0509 1.0500 1.1024 1.0775 1.1035 1.0527 2.5844 2.4699 7.2713 6.9759 6.6868 6.3673 12.5415 1.0330 1.0328 1.0335 1.0762 1.0651 1.0633 1.1040 1.1039 1.1028 1.1004 1.0992 1.0892 1.0897 1.0997 1.1037 1.0993 1.0891 1.0919 1.0937 1.0942 1.0952
irintensity: 0.6812 0.5264 3.0191 0.2376 1.7873 5.8081 2.6997 4.3737 1.5702 7.4962 3.5082 1.6177 3.1346 3.0444 0.3536 4.0114 0.2147 2.8385 1.2533 2.8695 1.4458 5.4926 0.1429 0.9184 1.8730 6.9288 0.0065 0.8846 5.5853 4.0377 4.8709 8.4013 24.4382 2.4386 5.8814 1.8903 1.5917 9.4822 13.9057 5.0722 9.5660 8.3280 4.4121 13.5490 36.4799 19.8391 0.5861 52.0530 8.6264 10.7864 7.3135 2.5047 0.6387 1.6341 0.3595 63.2998 23.7785 44.2615 8.7219 3.8413 11.4942 7.1422 64.5432 30.3282 0.2115 19.9351 7.3697 7.5710 1.0942 8.0254 4.7597 70.6247 2.4600 0.1216 65.9957 57.0271 132.2938 170.9893 38.1479 0.5521 5.8207 1.6501 11.4346 8.8691 11.8172 14.6230 2.1378 0.8711 10.3319 22.1242 13.8066 10.6127 14.3229 13.1983 10.8417 76.6770 59.7627 17.3602 132.2462 102.1612 21.9754 7.8358 9.3158 57.3884 6.8213 86.0228 53.2961 77.1773 5.7997 35.4874 38.1055 48.0382 44.6455 15.3642 11.4012 36.2797 20.6660 18.3830 16.0657 20.2473 28.7508 9.1166 5.9867 12.6592 13.0123 3.5101
temp: 298.150 k
press: 1.00000 atm
elementType: 8 8 8 7 6 6 6 6 6 6 6 6 6 6 6 6 6 6 6 6 6 6 6 1 1 1 1 1 1 1 1 1 1 1 1 1 1 1 1 1 1 1 1 1
symmnumber: 1
zpe: 929350.4 jmol-1
zpe.correction: 0.353971 hartree
zpe.thermalcorrener: 0.377278 hartree
zpe.thermalcorrenthalpy: 0.378222 hartree
zpe.thermalcorrgfe: 0.297390 hartree
zpe.sumelectzpe: -1015.295994 hartree
zpe.sumelectthermal: -1015.272687 hartree
zpe.sumelectthermalent: -1015.271743 hartree
zpe.sumelectthermalfe: -1015.352574 hartree
dipole: -1.1275 -3.1831 -0.2527
dipole: 3.3863
quadrupole: -99.8793 -123.3603 -145.3967
quadrupole: 17.5909 3.0887 3.0940
quadrupole: 22.9995 -0.4816 -22.5180 17.5909 3.0887 3.0940
hfenergy: -1015.6499645 hartree
pointgroup: C01 [X(C19H21N1O3)]
dipole: 0.4407407 1.2096819 0.3426631 debye
polarizability: 285.3323311|17.3511992|218.8973509|19.7463551|3.3196971|162.7025801 unknown
InChI: InChI=1S/C19H21NO3/c1-21-17-7-4-14(5-8-17)10-16(13-20)11-15-6-9-18(22-2)19(12-15)23-3/h4-9,12,16H,10-11H2,1-3H3
charge 0 multiplicity 1
44 atoms
O  3.588335 -2.140968 -0.989872
O  5.658951 -0.266442 -0.489965
O  -5.897523 -0.666752 -1.751842
N  -0.36093 -1.423923 2.393292
C  -0.445516 1.095153 1.507556
C  0.094195 1.212731 0.040847
C  -1.890882 1.693681 1.668288
C  1.563568 0.846955 -0.096328
C  -2.957128 1.050419 0.794037
C  1.956989 -0.468358 -0.445598
C  2.57599 1.804572 0.149447
C  -3.344302 1.642764 -0.438938
C  -3.591742 -0.156354 1.177929
C  -0.390792 -0.299543 1.993403
C  3.314186 -0.833397 -0.554354
C  3.942498 1.462045 0.043384
C  4.326112 0.14895 -0.316922
C  -4.320043 1.052183 -1.262158
C  -4.572702 -0.767495 0.364688
C  -4.936809 -0.159836 -0.862585
C  4.499975 -2.958074 -0.161174
C  6.705795 0.746839 -0.341087
C  -6.556039 -1.924117 -1.38999
H  0.229451 1.683709 2.163219
H  -0.064818 2.264647 -0.266359
H  -0.532363 0.584271 -0.615819
H  -2.172119 1.61686 2.735439
H  -1.811599 2.771901 1.431121
H  1.211964 -1.247645 -0.639027
H  2.302492 2.833543 0.414247
H  -2.877614 2.583718 -0.756018
H  -3.315323 -0.634763 2.1247
H  4.701906 2.228879 0.223738
H  -4.622173 1.507363 -2.210201
H  -5.038711 -1.700553 0.694932
H  4.085192 -3.077803 0.858336
H  5.504263 -2.505865 -0.113707
H  4.538564 -3.935858 -0.665022
H  6.729998 1.156624 0.687617
H  6.570259 1.571803 -1.067052
H  7.647272 0.2184 -0.551595
H  -7.125094 -1.823834 -0.445069
H  -5.823903 -2.749657 -1.295991
H  -7.24813 -2.134671 -2.218444
