program: Gaussian 09
title: 000245563
version: EM64L-G09RevD.01
frameworkgroup: C1[X(C8H12O2)]
method: RPBEPBE
basis: SDD
operation: Freq
keyword: #pfreq=noraman
keyword: PBEPBE/SDD
title: #p freq=noraman PBEPBE/SDD
converged: NO NO NO NO
title: Mulliken charges:
elementType: O O C C C C C C C C H H H H H H H H H H H H
charge: -0.199618 -0.207508 -0.158474 -0.234267 -0.433569 -0.435388 -0.380009 -0.404853 -0.356294 0.172444 0.243821 0.254208 0.210053 0.216633 0.234299 0.200119 0.188641 0.206410 0.217958 0.208308 0.222716 0.234369
chargesum: 0.00000
title: Mulliken charges with hydrogens summed into heavy atoms:
elementType: O O C C C C C C C C
charge: -0.199618 -0.207508 0.085347 0.019941 -0.006883 -0.000970 0.015042 0.021414 0.100791 0.172444
polarizability: 8.55124217e+01 -2.42770765e+00 9.29346468e+01 -2.82277261e-01 -1.63491614e+00 7.20920304e+01
1716.lowfreq: -16.5860 -0.0008 0.0002 0.0006 11.0227 18.8078 97.4655 134.9400 187.0457
frequency: 97.4347 134.8785 187.0343 245.7339 313.9457 334.3390 396.9786 444.2758 479.0130 536.2484 576.9891 673.0942 705.5676 756.5481 781.6078 834.4140 853.5978 897.9982 902.2390 915.0798 962.2501 977.1287 1029.7331 1036.2057 1063.9361 1087.0360 1107.8597 1114.5501 1150.2137 1155.6743 1200.6036 1233.1564 1237.6314 1272.1341 1292.7351 1302.5548 1318.9200 1334.7261 1338.5546 1345.7411 1354.3097 1359.5847 1459.0110 1466.9171 1470.8770 1476.6581 1480.6187 1699.9220 2955.7163 2967.2729 2970.7195 2982.0934 2988.7389 3008.3389 3021.7785 3037.9000 3040.1791 3045.2111 3055.0162 3093.8334
redmass: 4.5743 3.3520 3.7057 2.4167 2.0379 1.8551 3.6207 3.3064 4.6260 2.4089 3.9559 5.6254 4.6634 2.7268 2.1884 1.8741 2.6175 2.2549 2.4013 2.2469 2.5294 1.7575 2.6400 2.4406 1.6188 1.4630 1.9287 1.1854 1.5096 1.6747 1.3485 1.3384 1.6124 1.3297 1.6154 1.4896 1.3080 1.4409 1.4198 1.4640 1.4444 1.4673 1.0838 1.0863 1.0864 1.0858 1.0881 12.3852 1.0794 1.0657 1.0606 1.0616 1.0647 1.0659 1.0869 1.0952 1.0970 1.0986 1.1032 1.1065
irintensity: 2.7452 2.2308 2.0052 4.0192 0.5432 0.7901 0.1343 1.7447 2.2834 3.3124 5.0134 1.0298 0.6241 0.6148 0.5169 12.6538 3.6371 17.3953 60.3617 10.9933 2.7143 17.4546 49.5549 64.3021 0.7845 11.7403 34.4091 0.3935 2.1491 21.9051 7.1602 4.2607 5.2963 0.8303 4.2412 2.1456 0.6244 1.6771 0.3278 0.7649 0.9568 1.4362 11.1756 13.1760 10.9085 3.5733 12.6636 261.1042 19.4804 30.2005 26.8059 24.1731 33.8666 38.5484 23.9342 40.8353 70.9814 32.9239 60.6670 23.8009
temp: 298.150 k
press: 1.00000 atm
elementType: 8 8 6 6 6 6 6 6 6 6 1 1 1 1 1 1 1 1 1 1 1 1
symmnumber: 1
zpe: 493836.8 jmol-1
zpe.correction: 0.188092 hartree
zpe.thermalcorrener: 0.196544 hartree
zpe.thermalcorrenthalpy: 0.197488 hartree
zpe.thermalcorrgfe: 0.154953 hartree
zpe.sumelectzpe: -461.726131 hartree
zpe.sumelectthermal: -461.717679 hartree
zpe.sumelectthermalent: -461.716735 hartree
zpe.sumelectthermalfe: -461.759271 hartree
dipole: -2.8975 -3.3700 2.6657
dipole: 5.1825
quadrupole: -65.5781 -61.9722 -58.9451
quadrupole: -5.9655 5.0662 1.9809
quadrupole: -3.4130 0.1930 3.2200 -5.9655 5.0662 1.9809
hfenergy: -461.9142235 hartree
pointgroup: C01 [X(C8H12O2)]
dipole: -1.2259754 1.261988 -1.0304206 debye
dipolederiv: -0.5332159 -0.3287903 -0.070215 -0.087237 -1.1801238 0.1120558 -0.1387475 -0.1279797 -0.3351506 -0.5260569 0.1791326 -0.1258196 0.1141789 -1.0266313 0.1584959 -0.1645871 0.2652836 -0.4325913 -0.034127 -0.065627 -0.0250785 -0.1326111 0.0155222 -0.0776675 -0.0413971 -0.0401146 0.1172976 -0.1277275 -0.0139213 -0.1789768 0.0368882 -0.0395074 0.0591834 -0.2120171 0.0412263 -0.0530327 0.0401676 -0.0333026 0.0440081 -0.0479474 0.0703837 -0.0347296 0.0042895 0.0212917 0.0754124 0.1367343 0.0433601 0.063867 0.0359417 0.0368336 0.0065457 0.0443518 -0.0073646 0.1228866 0.0895033 -0.0146646 0.02586 -0.0018748 0.0346447 -0.0174248 0.0651119 -0.0260281 0.139537 0.0727848 -0.0038862 0.0336281 -0.0051829 0.0514947 -0.0133544 0.0107739 -0.0163058 0.0883068 0.2629709 -0.1338878 0.0087063 -0.0043299 0.5161308 -0.0710231 -0.0387063 -0.1619237 0.3347939 0.7453892 0.2124609 0.2869269 -0.0355853 1.6731707 -0.2224244 0.4595295 -0.0790172 0.4592271 0.0208481 0.0741903 -0.0624063 0.055333 0.0157913 0.0754448 -0.0369349 0.0875655 -0.0933766 -0.0284903 0.0201884 0.0982959 0.0209646 0.0601835 0.0019778 0.1001149 -0.0262212 -0.0654961 0.0327372 0.0329355 0.0224713 0.0434065 -0.2051744 -0.0350527 0.0210531 -0.0089499 0.0678554 -0.0105266 -0.0074428 -0.0944653 0.023028 0.0635134 0.0684238 -0.0671465 0.027882 -0.0823436 0.044173 0.0756266 0.0296294 0.0326429 -0.123422 -0.0455157 0.0347363 0.0096782 0.0780163 -0.0462959 -0.029058 -0.1020269 0.0033947 0.0842526 0.0524228 -0.0802678 -0.0013853 -0.1256991 -0.0005587 0.0125695 -0.086001 0.0147775 0.0124602 0.0426333 -0.159423 0.0663138 -0.1071196 -0.0757502 0.0332795 0.1220472 0.0267083 0.0353886 -0.0426382 0.1646793 -0.0547493 -0.0719847 0.0268175 0.0660808 -0.1031073 0.0381603 0.0425723 0.0101269 -0.0650709 0.0316324 -0.1051884 -0.1241517 -0.1408392 0.0225182 -0.1262856 -0.0495014 -0.0062243 0.0068621 -0.0165353 0.0760772 -0.0523128 -0.0106823 0.0917647 0.0062177 0.0075088 0.0324948 0.1205555 0.1285933 -0.0880122 0.0870876 0.0322777 -0.0016264 -0.0105884 -0.0954907 -0.0537504 -0.0277597 -0.1128921 0.0005846 unknown
polarizability: 85.2634515|1.9643351|93.2033755|0.242556|-1.5498134|72.0722719 unknown
InChI: InChI=1S/C8H12O2/c9-8-7-4-2-1-3-6(7)5-10-8/h6-7H,1-5H2
charge 0 multiplicity 1
22 atoms
O  1.976652 0.505298 0.475765
O  1.632935 -1.793747 0.602026
C  -0.080442 1.144103 -0.620738
C  0.192709 -0.364193 -0.887148
C  -1.070368 1.364848 0.551785
C  -1.020708 -1.314945 -0.814502
C  -2.331091 0.478505 0.435985
C  -1.93782 -1.016513 0.393532
C  1.339492 1.645539 -0.258608
C  1.302593 -0.694783 0.128295
H  -0.457218 1.647472 -1.52989
H  0.669886 -0.468415 -1.88604
H  -1.347408 2.435967 0.594619
H  -0.558911 1.128147 1.507594
H  -0.649255 -2.355858 -0.769598
H  -1.60566 -1.211106 -1.74951
H  -2.895233 0.740565 -0.483561
H  -3.004001 0.674628 1.291968
H  -1.416282 -1.287066 1.33352
H  -2.840844 -1.652906 0.334322
H  1.957481 1.864382 -1.148821
H  1.346693 2.507376 0.428106
