program: Gaussian 09
title: 000245549
version: EM64L-G09RevD.01
frameworkgroup: C1[X(C13H8Cl3N)]
method: RPBEPBE
basis: SDD
operation: Freq
keyword: #p
keyword: freq=noraman
keyword: PBEPBE/SDD
title: #p freq=noraman PBEPBE/SDD
converged: YES YES NO NO
title: Mulliken charges:
elementType: Cl Cl Cl N C C C C C C C C C C C C C H H H H H H H H
charge: -0.039102 -0.029923 -0.063323 -0.086162 0.537638 0.282772 -0.278707 -0.353243 -0.350694 -0.217913 -0.214615 -0.301424 -0.381700 -0.094419 -0.082936 -0.181238 -0.253801 0.290182 0.245639 0.284953 0.263543 0.269409 0.258269 0.236836 0.259961
chargesum: 0.00000
title: Mulliken charges with hydrogens summed into heavy atoms:
elementType: Cl Cl Cl N C C C C C C C C C C C C C
charge: -0.039102 -0.029923 -0.063323 -0.086162 0.537638 0.282772 -0.278707 -0.063061 -0.105055 0.067040 0.048927 -0.032015 -0.123431 -0.094419 -0.082936 0.055597 0.006160
polarizability: 3.68867804e+02 -2.11575392e+00 1.81837326e+02 9.94958117e+00 -4.60089456e+00 7.54311549e+01
1716.lowfreq: -0.0023 -0.0011 0.0010 1.0028 2.2727 5.3001 17.9528 38.9490 43.9446
frequency: 17.9433 38.9415 43.9415 97.5499 125.3255 158.1958 169.2048 174.2979 187.5628 225.7243 253.5037 284.3875 340.6194 367.0567 379.3841 399.8433 427.7073 440.5442 455.6682 506.3624 550.1535 577.8304 587.3883 647.1768 673.0015 682.9328 717.7266 734.8355 788.6713 839.3419 841.4352 866.6536 867.3822 879.9519 904.8572 975.3027 977.5243 981.4592 994.5806 1023.5909 1065.6688 1079.9423 1089.2542 1129.5087 1164.8866 1182.0498 1229.1284 1263.6837 1288.3530 1339.4461 1365.9555 1375.2359 1394.3668 1415.9034 1449.0576 1466.9527 1552.4831 1558.7063 1575.4595 1596.2420 1612.0541 3008.4008 3146.1933 3156.6988 3159.8858 3170.2491 3179.3159 3181.1758 3185.4745
redmass: 12.6695 9.1379 8.0343 7.3033 9.8827 4.8181 6.1716 7.2147 5.7530 9.0365 5.3106 6.3678 4.7514 8.7315 11.5021 8.0165 6.5103 3.1395 3.4323 5.7731 4.7042 4.9084 7.9157 7.2135 7.6958 2.2837 3.6927 7.2108 1.4175 1.4312 3.4495 1.4294 2.4764 2.4650 1.4652 1.9109 1.4950 2.2928 1.5070 3.7928 2.0003 2.4899 1.5573 1.5313 1.2859 2.0721 1.6791 1.6057 1.3476 2.7595 6.1990 2.1395 4.1802 3.3897 2.4202 2.8149 8.6609 6.2037 6.4833 7.5908 6.8959 1.0875 1.0875 1.0891 1.0921 1.0930 1.0966 1.0990 1.0939
irintensity: 0.1366 0.0532 0.2775 1.8356 0.8343 1.9659 2.1039 1.8528 3.7056 0.5957 8.0361 4.2066 1.1754 12.0391 9.3812 7.0995 15.5209 2.5716 16.0583 2.6130 8.5830 2.5464 3.3949 1.5255 10.6471 22.9937 4.1616 71.9321 48.0855 29.0992 19.9785 12.5126 81.8159 46.2113 5.8788 8.9856 2.0078 2.2350 9.8839 42.3878 20.5586 56.4646 17.1777 22.5037 1.4332 5.3932 3.5603 34.5770 5.6417 24.6817 0.3403 7.6719 31.3972 11.6657 6.6734 124.3580 40.8809 77.0366 190.2114 25.9508 5.7269 29.7560 10.5737 0.4076 0.7128 3.1737 2.9598 8.4837 0.7946
temp: 298.150 k
press: 1.00000 atm
elementType: 17 17 17 7 6 6 6 6 6 6 6 6 6 6 6 6 6 1 1 1 1 1 1 1 1
symmnumber: 1
zpe: 446131.1 jmol-1
zpe.correction: 0.169922 hartree
zpe.thermalcorrener: 0.185051 hartree
zpe.thermalcorrenthalpy: 0.185995 hartree
zpe.thermalcorrgfe: 0.124748 hartree
zpe.sumelectzpe: -1933.928171 hartree
zpe.sumelectthermal: -1933.913043 hartree
zpe.sumelectthermalent: -1933.912098 hartree
zpe.sumelectthermalfe: -1933.973346 hartree
dipole: -0.1457 -1.8185 0.5837
dipole: 1.9154
quadrupole: -120.9148 -112.6900 -122.4513
quadrupole: -7.7478 4.2469 -1.3627
quadrupole: -2.2294 5.9954 -3.7660 -7.7478 4.2469 -1.3627
hfenergy: -1934.0980938 hartree
pointgroup: C01 [X(C13H8Cl3N1)]
dipole: -0.0218711 -0.5030173 0.5607122 debye
dipolederiv: -0.1329306 -0.1828758 0.0446648 -0.0403187 -0.6607374 0.1673012 0.0109651 0.1698454 -0.0999219 -1.0904221 -0.1695972 -0.036733 -0.1883055 -0.145431 0.0123019 -0.0484365 0.0130931 -0.0580241 -0.4184929 -0.1806064 0.2033255 -0.3441845 -0.2987521 0.2679181 0.3865644 0.2782182 -0.409663 -0.8615155 -0.0092975 -0.0557872 0.2610473 -0.3186874 0.0765225 0.0171257 0.0505012 -0.2627187 -0.4195416 -0.0795472 -0.0166219 -0.14266 -0.325445 0.0800137 0.0728245 0.1017032 -0.0086096 0.7937058 0.010138 0.0500047 -0.0677546 0.1280805 -0.0932962 -0.0327054 -0.0570474 0.1258352 0.405749 0.351435 -0.0547647 -0.1491145 0.9931191 -0.313559 0.0732014 -0.2962052 0.0174045 0.0868704 0.0283446 0.0093575 0.207931 0.0382914 -0.0184503 -0.0434927 -0.0376483 -0.0890601 1.0552934 -0.0316219 0.1075777 0.2044635 0.2914417 -0.0520209 -0.0450335 -0.1098734 0.0130375 -0.5042798 -0.2473605 0.0354783 -0.3428506 -0.3202499 0.045713 0.0589496 0.0579451 -0.0665213 -0.540314 0.0561079 -0.0527703 0.140526 -0.0081454 -0.0239637 -0.0691778 -0.0292699 -0.106472 -0.3610569 -0.0740666 0.1003583 0.0065965 -0.196534 0.0711565 0.2643621 0.0878772 -0.1697843 -0.2937135 0.0574914 -0.0471853 -0.0844567 -0.0792425 -0.0776222 -0.1458293 -0.0895357 -0.0761348 1.4730887 0.2207227 0.0694127 0.2714394 0.3042163 -0.0859002 0.0728475 -0.0905533 -0.0279373 0.4561229 0.3022952 -0.3104426 0.5686956 0.352924 -0.4859751 -0.6703403 -0.4899496 0.5564546 0.1933504 0.0081882 0.0234769 -0.0045951 -0.0381286 -0.1166542 0.144409 -0.1310257 0.031112 -0.2037733 -0.0278018 0.0459241 -0.1600212 -0.1991868 0.0892152 0.1948014 0.0890262 -0.2365678 0.1168776 0.0530155 -0.022921 0.0459025 0.0508133 0.0322998 -0.0318441 0.0393063 0.134105 0.0139654 -0.0513632 0.0026928 -0.1337034 -0.0575331 0.045929 -0.075992 0.0763771 0.1443024 0.059091 0.0319336 -0.0197753 0.0386319 0.0670752 0.0363462 -0.0213213 0.0363888 0.1592044 0.0578279 -0.050949 0.004887 -0.0594475 0.0045289 0.0450992 0.0082372 0.0465507 0.154146 0.0741592 0.0280273 -0.0653954 0.0041615 0.1064356 0.0743461 -0.0801465 0.0588961 0.067606 0.0791893 -0.0676922 0.0587584 -0.0543509 0.0869375 0.0871968 0.0412273 0.0848547 0.063474 0.0033848 0.0410898 -0.0675326 0.0540794 0.0780655 0.1043819 -0.0838035 0.1052069 0.0175663 -0.0426357 -0.0160099 -0.0059894 -0.0317115 0.1461443 0.0317007 0.0026077 0.035318 0.1271668 unknown
polarizability: 367.87979|15.9790263|151.6936098|10.2518028|-48.189261|106.5628857 unknown
InChI: InChI=1S/C13H8Cl3N/c14-10-2-1-3-12(6-10)17-8-9-4-5-11(15)7-13(9)16/h1-8H
charge 0 multiplicity 1
25 atoms
Cl -2.024168 2.795261 -0.887232
Cl -6.20388 -0.75426 -0.195546
Cl 4.974397 1.607084 -1.700811
N  0.6368 -0.560169 0.41379
C  -1.641967 0.125548 -0.031046
C  2.0420 -0.361565 0.413621
C  -2.58054 1.116565 -0.424466
C  -2.160768 -1.157727 0.313038
C  -0.192657 0.379367 0.028585
C  -3.965415 0.871311 -0.481597
C  -3.536168 -1.438713 0.269506
C  2.715256 0.465238 -0.534859
C  2.801166 -1.076161 1.380319
C  -4.421423 -0.413527 -0.129891
C  4.113705 0.56586 -0.469831
C  4.202355 -0.93641 1.428445
C  4.880913 -0.11261 0.498268
H  -1.435732 -1.91986 0.615186
H  0.139565 1.399347 -0.241503
H  -4.661838 1.654441 -0.78936
H  -3.918434 -2.4271 0.537502
H  2.159965 0.98413 -1.322434
H  2.268921 -1.725046 2.081859
H  4.780122 -1.479163 2.183669
H  5.969729 -0.014642 0.515192
