program: Gaussian 09
title: 000245547
version: EM64L-G09RevD.01
frameworkgroup: C1[X(C10H12Cl2N2O2)]
method: RPBEPBE
basis: SDD
operation: Freq
keyword: #p
keyword: freq=noraman
keyword: PBEPBE/SDD
title: #p freq=noraman PBEPBE/SDD
converged: NO YES NO NO
title: Mulliken charges:
elementType: Cl Cl O O N N C C C C C C C C C C H H H H H H H H H H H H
charge: -0.060914 -0.063221 -0.309056 -0.252241 -0.389309 -0.397201 0.039399 -0.676359 -0.681700 0.629845 -0.361108 -0.294190 0.303023 -0.078828 -0.190686 -0.264901 0.236460 0.214176 0.254294 0.218952 0.211594 0.232172 0.223276 0.322450 0.275944 0.340940 0.256043 0.261148
chargesum: 0.00000
title: Mulliken charges with hydrogens summed into heavy atoms:
elementType: Cl Cl O O N N C C C C C C C C C C
charge: -0.060914 -0.063221 -0.309056 -0.252241 -0.066860 -0.056262 0.275859 0.011063 -0.014658 0.629845 -0.361108 -0.018246 0.303023 -0.078828 0.065356 -0.003753
polarizability: 1.82623016e+02 -2.43835615e+00 1.75202849e+02 1.54153636e+01 -5.11487333e-01 9.18912123e+01
1716.lowfreq: -15.7719 -3.2097 -0.0019 0.0015 0.0016 2.5135 12.7237 21.9739 32.7684
frequency: -6.3973 21.9393 32.6931 69.4853 80.3429 91.4400 137.8273 164.6458 182.4233 197.1930 205.5891 243.8303 269.9878 280.3658 307.0299 313.9157 343.9304 382.0616 410.5578 430.6213 444.1452 452.4421 485.3518 542.4729 569.5071 579.5804 633.6593 693.4011 696.4820 705.4518 711.9387 785.6566 808.1871 865.2770 886.7223 898.5828 923.6397 926.3220 940.8472 966.4757 1008.4440 1074.8136 1102.2960 1124.6415 1147.0298 1158.5674 1185.2647 1211.5716 1250.3793 1312.1072 1323.4653 1336.5849 1375.2998 1382.1832 1396.6656 1417.4933 1447.2451 1453.2925 1457.4611 1465.3916 1473.2604 1486.7948 1496.5932 1571.0967 1615.7793 1670.5737 2989.1055 2993.2706 3026.4797 3085.0388 3094.1127 3098.3502 3103.3949 3164.9520 3178.8533 3189.3821 3506.9905 3535.3927
redmass: 2.9049 5.7159 5.9272 7.4355 5.6177 10.2350 4.7371 6.8489 9.4990 1.0976 3.7964 1.1476 4.1615 5.3920 14.3015 4.9611 3.6512 4.0810 3.1735 1.9106 2.5205 2.7821 3.8024 5.3319 1.7269 2.6689 5.0411 4.4575 6.5717 4.5919 7.3292 1.3276 4.0238 1.4762 5.4654 2.9383 1.3342 1.2078 1.3981 7.2433 6.5542 1.8216 1.8193 1.7556 2.8262 2.0788 1.9917 2.2413 1.3655 2.6504 1.4136 1.3370 5.0395 1.2632 1.2279 4.3703 1.9407 1.6550 1.0741 1.0544 1.0564 1.0495 2.0385 5.2199 7.4409 9.5185 1.0356 1.0359 1.0866 1.0994 1.0988 1.1007 1.1007 1.0896 1.0918 1.0971 1.0777 1.0783
irintensity: 0.0575 0.3760 0.7623 5.4076 0.3430 0.3335 0.8474 1.8296 0.5907 0.3418 8.0413 0.4476 1.1057 10.8526 1.2606 11.1581 0.6416 7.2749 6.6047 54.3070 4.2903 3.8496 14.1175 10.5345 175.1258 61.5622 13.1184 0.7524 11.7061 0.4856 5.7686 42.4446 14.3647 33.3615 43.6920 7.8670 0.3080 2.7781 1.8887 79.2791 78.2406 35.5562 211.0154 47.6189 376.2693 44.6366 3.0089 70.5991 18.0971 6.4722 2.2120 4.7597 49.7190 29.9835 23.0580 12.5428 58.2023 137.8042 14.8693 6.5623 9.0135 23.1217 109.1152 18.1099 154.0448 208.4319 13.2356 21.3334 6.8098 5.2663 52.9393 17.5452 32.7253 1.2488 0.0706 0.6066 42.2679 36.3666
temp: 298.150 k
press: 1.00000 atm
elementType: 17 17 8 8 7 7 6 6 6 6 6 6 6 6 6 6 1 1 1 1 1 1 1 1 1 1 1 1
symmnumber: 1
zpe: 547839.7 jmol-1
zpe.correction: 0.208661 hartree
zpe.thermalcorrener: 0.224783 hartree
zpe.thermalcorrenthalpy: 0.225727 hartree
zpe.thermalcorrgfe: 0.163226 hartree
zpe.sumelectzpe: -1567.127367 hartree
zpe.sumelectthermal: -1567.111246 hartree
zpe.sumelectthermalent: -1567.110302 hartree
zpe.sumelectthermalfe: -1567.172803 hartree
dipole: -2.3791 -0.4599 -1.6986
dipole: 2.9591
quadrupole: -88.5507 -111.9226 -110.3734
quadrupole: -1.9219 3.6738 3.8209
quadrupole: 15.0649 -8.3070 -6.7578 -1.9219 3.6738 3.8209
hfenergy: -1567.3360286 hartree
pointgroup: C01 [X(C10H12Cl2N2O2)]
dipole: 0.9419734 0.1762332 -0.6610781 debye
polarizability: 182.4575182|-2.0438841|175.1463755|-15.4510639|4.5396817|92.1131839 unknown
InChI: InChI=1S/C10H12Cl2N2O2/c1-6(2)16-10(15)14-13-9-5-7(11)3-4-8(9)12/h3-6,13-14H,1-2H3
charge 0 multiplicity 1
28 atoms
Cl -2.861173 2.901614 0.281548
Cl -2.462158 -3.478669 -0.373756
O  2.882055 0.067283 -0.606345
O  1.537332 0.733518 1.223791
N  -0.456963 1.356915 -0.729641
N  0.794979 0.83096 -1.014536
C  4.006115 -0.315298 0.326151
C  3.749471 -1.732056 0.855946
C  5.281898 -0.177932 -0.506443
C  -1.53152 0.522176 -0.378873
C  -2.751999 1.082584 0.088021
C  -1.461436 -0.890684 -0.513711
C  1.720959 0.554757 -0.001354
C  -2.584373 -1.667645 -0.18828
C  -3.863396 0.292413 0.413318
C  -3.793202 -1.114067 0.274544
H  3.988544 0.410207 1.160792
H  4.572888 -2.037536 1.527245
H  2.80848 -1.770587 1.430348
H  3.694513 -2.454911 0.022644
H  6.162697 -0.416486 0.116551
H  5.393692 0.850657 -0.889588
H  5.265716 -0.872069 -1.365121
H  -0.498076 2.336071 -0.433999
H  -0.535017 -1.354183 -0.860594
H  1.069166 0.707474 -1.991201
H  -4.781433 0.765216 0.773563
H  -4.648957 -1.745922 0.521883
