program: Gaussian 09
title: 000245524
version: EM64L-G09RevD.01
frameworkgroup: C1[X(C11H23N3O)]
method: RPBEPBE
basis: SDD
operation: Freq
keyword: #p
keyword: freq=noraman
keyword: PBEPBE/SDD
title: #p freq=noraman PBEPBE/SDD
converged: YES YES NO NO
title: Mulliken charges:
elementType: O N N N C C C C C C C C C C C H H H H H H H H H H H H H H H H H H H H H H H
charge: -0.310724 -0.087822 -0.374986 -0.370010 -0.401879 -0.375129 -0.361261 -0.382193 -0.370771 -0.354234 -0.317899 -0.317459 -0.355907 0.180764 -0.695900 0.201175 0.220364 0.192753 0.191671 0.183998 0.213316 0.192371 0.195599 0.189757 0.189807 0.188458 0.188926 0.238190 0.193916 0.197293 0.231311 0.195016 0.194900 0.329741 0.330802 0.209816 0.210261 0.215970
chargesum: 0.00000
title: Mulliken charges with hydrogens summed into heavy atoms:
elementType: O N N N C C C C C C C C C C C
charge: -0.310724 -0.087822 -0.045245 -0.039208 0.019660 0.009295 0.036053 0.005776 0.008793 0.023150 0.114208 0.111145 0.034009 0.180764 -0.059853
polarizability: 1.90197380e+02 -3.68183731e+00 1.30263719e+02 -8.72880458e+00 -1.59162561e+00 1.10026876e+02
1716.lowfreq: -22.6370 -6.8392 -0.0006 -0.0005 -0.0003 5.0337 16.0986 26.3333 35.8454
frequency: 9.4216 25.5100 35.4881 52.2819 74.1202 86.4442 92.2376 105.3912 127.2578 135.4441 142.8104 171.0316 203.9413 229.9733 241.4130 309.3279 332.3216 367.4250 407.6961 426.0600 447.2274 480.5654 496.0916 530.0093 573.8386 703.9038 720.6086 727.9023 733.2150 751.2805 793.6582 814.9014 857.7791 888.1827 920.0267 938.2326 984.7009 1003.9064 1012.2266 1014.2022 1021.4067 1051.2409 1063.7142 1078.5142 1081.1012 1083.6673 1117.8920 1126.0574 1153.0264 1161.6824 1175.8471 1193.9930 1216.5209 1218.9566 1232.1752 1259.6573 1265.1520 1279.4074 1281.1989 1286.2699 1293.2615 1294.7006 1302.0238 1314.8655 1339.0021 1353.2404 1355.7959 1363.8356 1378.9552 1387.5115 1403.0022 1416.1179 1458.3195 1460.7088 1460.8048 1465.1105 1466.5685 1472.3923 1476.7748 1478.8998 1485.1815 1488.5684 1491.7049 1499.1716 1665.8287 2796.9882 2809.1305 2840.8387 2950.0841 2951.5947 2954.1526 2961.0140 2967.8372 2971.3437 2973.9474 2984.3996 2992.3005 3003.9466 3007.8580 3021.3590 3028.8266 3036.2996 3046.4464 3052.0656 3067.6047 3070.6761 3598.4851 3602.2746
redmass: 2.3450 2.7676 3.6475 3.5678 2.3113 2.3719 2.3351 2.4980 2.6511 2.1509 2.5405 4.5757 3.7848 1.1083 2.7759 3.2695 2.1467 3.6532 1.4316 3.2441 3.7409 3.4811 1.1339 3.9408 5.4381 8.6329 1.0631 1.2509 2.5509 1.1619 1.1920 5.5794 1.2279 1.8914 2.8985 1.3182 4.2290 1.9425 1.4942 1.9133 2.4755 2.9854 2.4266 2.4572 2.2925 2.1628 2.3713 2.2564 2.9993 2.2125 2.3101 1.6596 1.1498 1.3433 1.4023 1.3108 1.2624 1.1790 1.0819 1.2458 1.1455 1.1623 1.2580 1.4640 1.4407 1.6552 1.6089 1.5007 1.6791 1.2166 1.3359 1.4802 1.4766 1.1613 1.0757 1.1383 1.1152 1.0832 1.0430 1.0819 1.0877 1.0935 1.2761 1.1154 4.7929 1.0722 1.0713 1.0700 1.0587 1.0586 1.0591 1.0592 1.0587 1.0366 1.0625 1.0962 1.0982 1.0993 1.0882 1.1037 1.0881 1.1041 1.0919 1.0993 1.1007 1.0993 1.0770 1.0788
irintensity: 0.1623 0.8440 0.9573 0.4980 0.1159 0.2782 0.0220 0.2263 1.0887 0.2561 1.7380 0.6745 2.5640 0.0070 3.5098 1.0132 2.3344 6.2125 2.4602 10.0433 10.3404 13.8023 208.1593 8.5728 0.3979 65.8466 14.2740 0.5498 6.3352 7.1817 0.4183 11.4210 0.9350 3.9968 19.0440 6.3608 2.2896 5.6286 3.7783 7.0924 1.9843 4.9006 7.6902 2.5885 11.2855 10.4461 27.7391 6.8475 8.1886 123.6079 3.3534 2.1249 1.4958 12.5019 2.2110 8.4723 4.5719 3.2886 2.9706 29.4897 0.2856 18.0588 7.3650 44.1282 1.9618 3.0766 0.2011 40.9557 8.9064 11.5069 4.8614 44.4606 76.7077 20.7787 0.1788 15.7816 8.5854 0.9636 12.2158 1.5345 1.1378 23.9848 65.9299 4.4055 525.3947 56.7120 137.7682 168.1833 0.0964 2.7979 0.3326 28.4879 116.1086 34.3795 61.3831 1.5137 1.7126 5.2210 16.9069 0.0747 39.7874 53.5651 61.2650 107.0752 98.5921 55.2983 61.9413 18.7764
temp: 298.150 k
press: 1.00000 atm
elementType: 8 7 7 7 6 6 6 6 6 6 6 6 6 6 6 1 1 1 1 1 1 1 1 1 1 1 1 1 1 1 1 1 1 1 1 1 1 1
symmnumber: 1
zpe: 882708.6 jmol-1
zpe.correction: 0.336206 hartree
zpe.thermalcorrener: 0.354188 hartree
zpe.thermalcorrenthalpy: 0.355132 hartree
zpe.thermalcorrgfe: 0.286512 hartree
zpe.sumelectzpe: -671.220556 hartree
zpe.sumelectthermal: -671.202575 hartree
zpe.sumelectthermalent: -671.201630 hartree
zpe.sumelectthermalfe: -671.270250 hartree
dipole: -5.0166 2.1644 1.9802
dipole: 5.8113
quadrupole: -136.9773 -87.2364 -94.6334
quadrupole: 13.5378 7.9867 -5.0389
quadrupole: -30.6949 19.0460 11.6490 13.5378 7.9867 -5.0389
hfenergy: -671.5567621 hartree
pointgroup: C01 [X(C11H23N3O1)]
dipole: -1.9758099 -0.7657914 -0.8585779 debye
polarizability: 190.1460985|2.418626|130.3414193|9.4319073|0.0688443|110.000457 unknown
InChI: InChI=1S/C11H23N3O/c1-2-3-4-5-6-7-8-14-9-12-11(15)13-10-14/h12-13H,2-10H2,1H3
charge 0 multiplicity 1
38 atoms
O  6.078303 0.872433 0.807555
N  2.296889 -0.41294 0.053571
N  4.015667 1.256239 -0.226217
N  4.630551 -0.91854 0.39672
C  -0.199129 0.003482 -0.018497
C  -1.569838 -0.671836 -0.25405
C  0.972105 -0.935706 -0.370383
C  -2.765995 0.253212 0.063466
C  -4.135061 -0.434123 -0.141475
C  -5.336829 0.48088 0.184256
C  2.705567 0.796887 -0.70106
C  3.351378 -1.447568 -0.085913
C  -6.703535 -0.215639 -0.008778
C  4.978947 0.429988 0.352068
C  -7.900622 0.700109 0.325596
H  -0.152376 0.932278 -0.622021
H  -0.101692 0.30181 1.043314
H  -1.63984 -1.584497 0.374023
H  -1.641743 -1.012557 -1.308499
H  0.94878 -1.163059 -1.469068
H  0.820282 -1.897274 0.158053
H  -2.711353 1.159584 -0.575308
H  -2.687029 0.606884 1.112522
H  -4.185577 -1.343174 0.494108
H  -4.215973 -0.785224 -1.191734
H  -5.295105 1.387192 -0.45581
H  -5.254015 0.837489 1.232385
H  1.961461 1.593868 -0.533313
H  2.7367 0.582472 -1.804322
H  3.444278 -1.785312 -1.153577
H  3.064248 -2.324985 0.521279
H  -6.741322 -1.123089 0.628202
H  -6.787331 -0.568878 -1.057001
H  4.231157 2.251369 -0.207217
H  5.295637 -1.528053 0.868874
H  -7.903602 1.600301 -0.31792
H  -7.856893 1.041289 1.37725
H  -8.864289 0.178087 0.179917
