program: Gaussian 09
title: 000245539
version: EM64L-G09RevD.01
frameworkgroup: C1[X(C21H28N2S)]
method: RPBEPBE
basis: SDD
operation: Freq
keyword: #p
keyword: freq=noraman
keyword: PBEPBE/SDD
title: #p freq=noraman PBEPBE/SDD
converged: YES YES NO NO
title: Mulliken charges:
elementType: S N N C C C C C C C C C C C C C C C C C C C C C H H H H H H H H H H H H H H H H H H H H H H H H H H H H
charge: -0.051912 -0.152808 -0.151705 0.442490 0.444052 -0.396849 -0.398604 -0.398062 -0.396885 0.507592 0.506495 -0.372272 -0.373362 -0.390131 -0.386963 -0.629572 -0.400710 -0.401192 -0.403634 -0.404649 -0.661276 -0.660861 -0.660583 -0.663421 0.221277 0.230563 0.222009 0.227382 0.227434 0.220733 0.226819 0.222378 0.226007 0.225692 0.226467 0.225554 0.264081 0.264043 0.262555 0.262978 0.241820 0.215538 0.216136 0.241993 0.217342 0.214731 0.216264 0.245099 0.215226 0.217586 0.242273 0.214845
chargesum: 0.00000
title: Mulliken charges with hydrogens summed into heavy atoms:
elementType: S N N C C C C C C C C C C C C C C C C C C C C C
charge: -0.051912 -0.152808 -0.151705 0.442490 0.444052 0.054991 0.050786 0.050104 0.052312 0.507592 0.506495 -0.146264 -0.147670 -0.163664 -0.161409 -0.629572 -0.136629 -0.137150 -0.141079 -0.141671 0.012218 0.013205 0.016006 0.011283
polarizability: 5.33977755e+02 -4.01297399e-01 3.03609913e+02 1.11528523e+01 -5.96747014e+00 1.68074494e+02
1716.lowfreq: -7.6831 -3.8741 -0.0014 -0.0009 0.0010 7.6776 20.0791 28.5467 31.1939
frequency: 19.8713 28.5357 31.0295 47.0784 61.4139 68.2986 75.6686 83.5303 95.9950 103.3865 110.5459 119.7534 149.9918 163.3941 187.4120 212.3841 214.3074 219.6144 221.7584 227.3162 265.5666 265.7286 306.4048 319.2994 325.8409 337.7905 394.5549 408.2265 411.6786 418.6430 436.9738 442.4420 455.6388 493.0349 516.2113 530.3407 540.0493 552.1957 578.6662 617.2285 632.2914 638.1297 696.2822 728.1290 735.8770 747.2089 785.4851 786.2203 786.4312 788.9378 804.0764 810.5299 824.4593 828.8552 887.7835 892.2637 893.0078 922.6993 923.2680 953.6510 960.3214 967.0631 974.2221 978.2265 997.9474 1006.3074 1015.0055 1017.6787 1072.9341 1073.2067 1077.2540 1077.9946 1094.5765 1095.7968 1130.8849 1138.8748 1160.5895 1160.8669 1200.0572 1200.5883 1201.9282 1202.8284 1240.3166 1267.2892 1268.7241 1287.5073 1288.2433 1304.8522 1319.6334 1320.5147 1339.2721 1340.6356 1348.0584 1351.8150 1359.2850 1367.7689 1384.8409 1386.9435 1389.1392 1389.7347 1399.5298 1401.5736 1444.2813 1446.3045 1466.8338 1466.9853 1468.5959 1469.8893 1476.7838 1477.0739 1482.6018 1482.8365 1492.3349 1493.0296 1502.0854 1503.6522 1521.5356 1523.5537 1534.1093 1540.5191 1614.0373 1625.3466 2983.0447 2983.9285 2983.9989 2984.6409 2990.3071 2990.9476 2995.9272 2997.2006 3039.2057 3041.1821 3045.1529 3046.4898 3078.9667 3079.6935 3079.9842 3080.8389 3092.7133 3092.8680 3094.0474 3094.4922 3136.3438 3137.0496 3137.8945 3140.4162 3159.2971 3161.7835 3164.4139 3166.9506
redmass: 3.6037 4.3410 3.3657 5.0930 3.4156 3.2471 2.9897 3.1644 3.2800 4.2531 3.2934 3.5540 3.2629 3.4610 2.5988 2.2541 1.3105 1.3266 1.1829 1.4208 2.8504 2.9030 2.9964 3.4799 3.0522 3.3071 3.8141 3.5001 3.1750 3.0525 3.2540 3.5194 2.9942 3.1286 2.7684 3.0239 3.1611 2.7890 3.6043 4.2143 7.0677 4.9711 4.2684 4.2937 3.9472 4.2694 1.1495 1.1449 1.1634 1.2262 1.2752 1.2590 1.7061 1.7859 6.0626 2.3199 2.3376 2.1826 2.1584 1.3606 1.5096 1.3719 1.3172 3.9262 2.7956 3.3435 2.8320 2.8241 2.1638 2.1618 1.8092 1.8021 1.6712 1.6706 1.5595 1.5836 1.9227 1.9401 1.5231 1.5557 2.0500 1.4893 2.2853 1.3892 1.3611 1.2169 1.2137 1.7149 2.2846 1.3617 1.2837 1.2785 1.3539 1.3392 3.5186 4.3225 1.2151 1.2175 1.2212 1.2298 1.9744 1.9948 4.0298 3.8658 1.0473 1.0477 1.0433 1.0432 1.0679 1.0659 1.0474 1.0480 1.0855 1.0861 1.2986 1.2468 2.1936 2.4240 6.2808 6.6843 5.9564 6.3443 1.0356 1.0358 1.0357 1.0357 1.0602 1.0609 1.0608 1.0611 1.1028 1.1021 1.1022 1.1020 1.0997 1.0997 1.0994 1.0997 1.1011 1.1010 1.1008 1.1008 1.0873 1.0877 1.0879 1.0867 1.0941 1.0938 1.0951 1.0950
irintensity: 1.2426 1.0880 0.3213 0.7112 0.5849 0.9290 0.1804 0.2516 1.0708 2.6894 3.1374 0.0814 0.7567 0.2676 1.0254 0.9305 0.1597 0.3050 0.6616 0.1167 0.4428 0.1968 1.6513 0.3243 0.1532 0.8194 8.1899 10.5766 5.7539 3.2976 4.7416 7.5685 3.6850 14.4291 8.0973 26.2708 1.1541 0.4943 5.3246 6.8516 1.2009 7.7045 9.9580 5.4367 0.0819 5.5559 6.4217 13.3880 16.8097 6.1637 25.1343 1.4960 35.5744 95.2668 9.0901 0.7482 0.6588 5.0896 3.7444 1.9065 6.9614 14.4466 1.8371 14.7944 4.6978 36.9441 80.6048 0.0861 13.2504 12.8454 84.0391 13.8151 16.7532 17.8941 6.1699 1.2780 98.1746 20.8939 190.1443 95.1178 103.3588 144.8073 45.4213 203.8085 41.2093 3.1571 3.7381 115.6238 430.6366 22.0047 22.8905 22.2819 119.0845 79.2734 6.9716 9.3490 10.4219 3.6422 30.3335 38.1174 141.2023 197.1067 20.5435 1.7618 6.2125 8.4336 9.6748 8.0436 0.6949 0.2994 0.8872 0.7927 29.3015 33.0478 8.8566 11.1285 37.3794 104.4414 7.6038 16.3131 1141.2812 204.3963 30.7097 35.4179 35.4091 31.7740 50.8388 47.4761 90.1914 69.0232 5.2488 5.7913 15.7522 9.6266 40.8547 30.6401 62.8583 50.3862 8.1483 16.1396 98.9900 70.0582 9.6663 9.0770 3.3037 4.1710 27.7815 22.9202 31.4420 18.6638
temp: 298.150 k
press: 1.00000 atm
elementType: 16 7 7 6 6 6 6 6 6 6 6 6 6 6 6 6 6 6 6 6 6 6 6 6 1 1 1 1 1 1 1 1 1 1 1 1 1 1 1 1 1 1 1 1 1 1 1 1 1 1 1 1
symmnumber: 1
zpe: 1158561.7 jmol-1
zpe.correction: 0.441273 hartree
zpe.thermalcorrener: 0.466549 hartree
zpe.thermalcorrenthalpy: 0.467493 hartree
zpe.thermalcorrgfe: 0.384377 hartree
zpe.sumelectzpe: -1322.802505 hartree
zpe.sumelectthermal: -1322.777229 hartree
zpe.sumelectthermalent: -1322.776285 hartree
zpe.sumelectthermalfe: -1322.859401 hartree
dipole: 0.0972 -7.4208 0.5462
dipole: 7.4415
quadrupole: -87.6095 -160.9695 -154.0751
quadrupole: 1.2210 3.4375 0.4459
quadrupole: 46.6085 -26.7515 -19.8570 1.2210 3.4375 0.4459
hfenergy: -1323.2437777 hartree
pointgroup: C01[X(C21H28N2S1)]
dipole: -0.1218701 2.4274763 -1.6321644 debye
polarizability: 531.6491031|-12.7644555|257.6789265|-28.0631881|-63.757237|216.3341325 unknown
InChI: InChI=1S/C21H28N2S/c1-5-22(6-2)19-13-9-17(10-14-19)21(24)18-11-15-20(16-12-18)23(7-3)8-4/h9-16H,5-8H2,1-4H3
charge 0 multiplicity 1
52 atoms
S  0.149265 -2.975131 2.214401
N  -5.079877 0.717965 -0.025179
N  5.023425 0.837132 -0.571199
C  -3.824603 0.190317 0.288202
C  3.821712 0.267038 -0.142287
C  -6.263641 0.467119 0.822972
C  -5.295604 1.545716 -1.229326
C  6.187648 0.007024 -0.94367
C  5.196477 2.300904 -0.665414
C  -1.218575 -0.907417 0.945779
C  1.325457 -0.923401 0.743073
C  -3.595167 -0.523814 1.513809
C  3.688882 -1.15075 0.049136
C  -2.706956 0.331277 -0.599202
C  2.665107 1.068851 0.132436
C  0.082296 -1.535091 1.257609
C  -2.340298 -1.064436 1.813405
C  2.485266 -1.71355 0.487095
C  -1.446693 -0.187994 -0.267363
C  1.459724 0.485823 0.551446
C  -6.42533 1.485908 1.975585
C  -5.62304 0.720116 -2.496435
C  7.081029 -0.38252 0.257925
C  4.708162 2.897398 -2.006963
H  -7.157691 0.50355 0.171901
H  -6.21893 -0.561776 1.2240
H  -6.130786 2.239866 -1.016683
H  -4.406861 2.179281 -1.403978
H  5.840179 -0.900059 -1.471534
H  6.786395 0.578594 -1.677821
H  4.679552 2.789732 0.180986
H  6.272695 2.521812 -0.535945
H  -4.40221 -0.644417 2.241879
H  4.538671 -1.815193 -0.131626
H  -2.827991 0.822608 -1.56871
H  2.703799 2.155945 0.017795
H  -2.190463 -1.622049 2.744396
H  2.411964 -2.7944 0.650037
H  -0.629633 -0.087255 -0.989559
H  0.610324 1.139299 0.776742
H  -5.553655 1.461708 2.652154
H  -6.51912 2.513994 1.58113
H  -7.331995 1.260956 2.567524
H  -4.804694 0.019268 -2.735621
H  -6.544001 0.12675 -2.351589
H  -5.777484 1.386705 -3.365303
H  7.477603 0.517748 0.761463
H  6.511661 -0.963303 1.003815
H  7.938768 -0.99387 -0.079086
H  5.256522 2.45254 -2.857013
H  3.632536 2.702609 -2.159344
H  4.87088 3.991172 -2.027246
