program: Gaussian 09
title: 000245534
version: EM64L-G09RevD.01
frameworkgroup: C1[X(C16H24N2O7)]
method: RPBEPBE
basis: SDD
operation: Freq
keyword: #p
keyword: freq=noraman
keyword: PBEPBE/SDD
title: #p freq=noraman PBEPBE/SDD
converged: YES YES NO NO
title: Mulliken charges:
elementType: O O O O O O O N N C C C C C C C C C C C C C C C C H H H H H H H H H H H H H H H H H H H H H H H H
charge: -0.247258 -0.247292 -0.431000 -0.432383 -0.457832 -0.450543 -0.485913 -0.101716 -0.102778 -0.284291 -0.283313 -0.336717 -0.347045 -0.337989 -0.346416 0.455196 0.443205 -0.708697 -0.326848 -0.318654 -0.326561 -0.319993 0.121275 0.099061 -0.159191 0.218968 0.216988 0.248578 0.189181 0.196161 0.224973 0.247562 0.189308 0.195179 0.228679 0.252783 0.214956 0.192659 0.189712 0.213745 0.214615 0.192189 0.190983 0.214548 0.376151 0.377485 0.383749 0.380778 0.383767
chargesum: 0.00000
title: Mulliken charges with hydrogens summed into heavy atoms:
elementType: O O O O O O O N N C C C C C C C C C C C C C C C C
charge: -0.247258 -0.247292 -0.054849 -0.054898 -0.074083 -0.069765 -0.102146 -0.101716 -0.102778 -0.065324 -0.066324 0.101042 0.074088 0.098881 0.077442 0.455196 0.443205 -0.455914 0.080766 0.084803 0.080243 0.085538 0.121275 0.099061 -0.159191
polarizability: 2.60552450e+02 -1.36915871e+00 2.02222229e+02 -2.29434831e+01 -1.78821010e-01 1.77874775e+02
1716.lowfreq: -8.8741 -0.0009 -0.0008 -0.0007 3.5084 6.7442 22.0568 26.3920 35.9234
frequency: 22.0100 26.2117 35.6715 46.6223 52.2288 54.0542 103.8621 117.1258 130.8969 158.9486 162.5164 193.6439 199.4759 214.6578 218.0667 240.0838 254.1375 261.1425 271.4538 280.0733 286.9178 294.9556 302.2397 318.8426 335.4039 362.3661 393.5580 398.7205 430.4042 462.7581 463.8636 472.6524 479.6053 490.1631 497.6650 506.6995 532.5051 546.8786 560.2990 568.1355 575.6977 598.2572 605.7094 640.1377 668.2277 675.7052 730.9378 755.6047 789.2512 790.7963 806.9432 810.7054 843.2189 844.4655 872.7955 902.7050 907.0185 912.1456 939.8109 978.3898 980.5865 988.5454 997.4189 1025.0375 1025.7602 1051.5331 1052.5485 1075.6732 1082.2163 1085.6271 1092.2046 1100.9236 1110.7500 1115.3457 1127.2024 1158.9137 1159.8027 1181.3823 1189.6003 1191.1011 1209.5320 1241.0304 1242.4171 1248.5305 1262.1520 1264.1670 1266.8429 1270.5677 1272.6130 1289.7345 1293.3601 1295.0250 1312.3616 1329.4277 1330.8662 1341.9596 1345.0691 1348.1538 1369.8120 1370.3482 1376.4540 1377.8134 1405.0828 1410.7484 1413.0212 1442.3117 1444.4293 1444.4983 1450.3985 1451.3986 1451.5960 1452.9837 1464.3040 1465.8590 1494.8438 1621.1431 1623.6454 2869.7763 2870.1292 2876.8111 2876.9875 2904.8404 2906.3669 2952.8825 2953.2106 2958.0800 2958.7709 3054.4048 3058.0642 3063.4851 3065.3427 3079.2099 3079.7695 3082.9350 3083.3133 3121.6596 3475.0409 3482.7816 3499.1474 3509.7929 3514.3251
redmass: 6.0200 4.2780 3.3580 3.5440 5.3680 6.7322 4.8931 4.6895 5.2412 5.8436 7.8691 5.3865 4.7228 1.9313 2.7875 2.3394 3.9586 2.8327 3.6787 2.8789 3.1887 3.1027 3.5298 5.0317 5.6958 5.7226 1.9440 1.9370 4.9574 2.8360 2.8448 2.1406 5.1997 1.3378 3.9594 2.7623 3.5860 1.7331 1.4592 1.0880 4.6237 2.3630 2.0909 4.2513 4.3064 5.8194 5.4525 5.7790 4.5880 4.0304 3.5427 3.8421 1.6086 1.6042 3.9560 2.5610 2.4497 1.5881 4.5434 4.7838 4.2600 3.0036 3.3695 2.1521 2.1469 2.0351 2.1044 3.9283 3.6480 3.1708 2.5302 2.6259 2.2811 2.5372 1.4572 3.8105 3.8152 1.3569 1.0712 1.1033 2.1569 1.2825 1.2881 2.4644 1.3921 1.3857 1.3466 1.2975 1.3519 1.5092 1.2313 1.2312 1.3552 1.2830 1.2672 1.5465 1.3327 1.6233 1.2684 1.2634 1.4757 1.5414 1.5843 2.3464 1.2765 1.0831 2.4557 1.3992 1.0982 1.0845 1.0967 1.0823 1.0983 1.0989 4.4448 7.1272 7.3675 1.0708 1.0708 1.0702 1.0704 1.0820 1.0821 1.0665 1.0666 1.0667 1.0666 1.0888 1.0885 1.0897 1.0895 1.0962 1.0961 1.0977 1.0976 1.0911 1.0646 1.0646 1.0647 1.0648 1.0664
irintensity: 0.2069 0.4340 0.0762 0.7394 0.5257 0.3592 2.7016 8.2568 1.7107 0.3794 0.8325 32.9576 2.4131 39.0063 12.8051 2.2821 0.1177 2.9750 3.3521 14.1213 6.2416 0.5029 5.3807 22.0149 2.0738 1.3060 0.6259 0.0667 6.7257 3.3336 0.5151 14.1738 10.8175 210.6643 7.1551 27.4816 38.8655 244.1352 123.3795 67.4954 19.1638 1.0513 80.6461 64.5702 26.2097 0.2802 1.5085 11.0654 0.7412 19.6602 12.4475 15.8388 0.1043 0.1500 16.1818 20.5479 5.6174 59.4426 40.7469 121.7207 40.2442 127.5457 5.1780 6.8800 9.9155 24.9561 28.8080 183.7742 15.8610 43.7932 0.4412 127.7099 2.0226 333.8368 32.7647 24.4262 20.7280 30.1326 0.3267 6.8854 143.9450 29.6347 87.7522 2.0192 18.5616 15.4913 14.9508 0.8612 0.6096 50.1899 11.5685 4.4327 55.5540 0.1916 0.9331 7.5402 19.1550 5.2348 2.6138 1.9149 20.4313 25.1255 128.7903 16.9373 22.1775 2.1825 43.8215 14.2579 16.5678 3.4550 14.2786 1.3937 9.4585 7.5269 42.6485 4.3574 58.5251 9.8595 73.8734 4.9166 156.0700 59.0033 103.7175 42.7316 34.1183 104.2235 98.7767 33.1859 31.9048 14.0680 14.4386 35.5764 40.6033 35.9959 41.6160 5.1554 35.4331 33.4023 43.4906 84.6205 15.7943
temp: 298.150 k
press: 1.00000 atm
elementType: 8 8 8 8 8 8 8 7 7 6 6 6 6 6 6 6 6 6 6 6 6 6 6 6 6 1 1 1 1 1 1 1 1 1 1 1 1 1 1 1 1 1 1 1 1 1 1 1 1
symmnumber: 1
zpe: 1041826.8 jmol-1
zpe.correction: 0.396811 hartree
zpe.thermalcorrener: 0.421129 hartree
zpe.thermalcorrenthalpy: 0.422073 hartree
zpe.thermalcorrgfe: 0.342369 hartree
zpe.sumelectzpe: -1258.147353 hartree
zpe.sumelectthermal: -1258.123035 hartree
zpe.sumelectthermalent: -1258.122091 hartree
zpe.sumelectthermalfe: -1258.201795 hartree
dipole: 0.5116 5.3181 0.5286
dipole: 5.3687
quadrupole: -172.9697 -126.8799 -161.0438
quadrupole: 1.9361 -7.9071 1.7321
quadrupole: -19.3386 26.7513 -7.4127 1.9361 -7.9071 1.7321
hfenergy: -1258.5441641 hartree
pointgroup: C01 [X(C16H24N2O7)]
dipole: 0.216025 2.0746863 0.3324416 debye
polarizability: 259.6813798|-0.1713487|202.1526038|-24.4777733|1.4171165|178.8154701 unknown
InChI: InChI=1S/C16H24N2O7/c19-12-10(15(22)17-1-5-24-6-2-17)9-11(13(20)14(12)21)16(23)18-3-7-25-8-4-18/h9,15-16,19-23H,1-8H2
charge 0 multiplicity 1
49 atoms
O  5.714319 -1.562751 1.162284
O  -5.613288 -1.594846 -1.270429
O  2.503933 -0.148614 -2.566529
O  -2.62009 0.015281 2.562055
O  -2.123631 2.363994 1.137758
O  2.120474 2.285268 -1.229741
O  0.030367 3.724826 -0.033527
N  3.471584 -0.630326 -0.422933
N  -3.465819 -0.58364 0.396595
C  2.216388 -0.63926 -1.21704
C  -2.258529 -0.551471 1.26056
C  4.484438 -1.561435 -0.994341
C  3.328855 -0.856576 1.038088
C  -4.505861 -1.49595 0.948954
C  -3.242816 -0.863175 -1.045263
C  1.100982 0.161921 -0.554624
C  -1.099381 0.203859 0.619223
C  0.001974 -0.482891 0.058759
C  5.832102 -1.348671 -0.291915
C  4.69627 -0.654884 1.714817
C  -5.813461 -1.322369 0.164376
C  -4.572478 -0.700111 -1.802285
C  -1.070133 1.619259 0.586636
C  1.088433 1.577446 -0.5909
C  0.038704 2.289513 0.027707
H  1.849405 -1.676696 -1.400526
H  -1.91027 -1.578317 1.52356
H  4.574918 -1.357035 -2.074864
H  4.166515 -2.626269 -0.864795
H  2.959853 -1.887935 1.265469
H  2.605352 -0.136179 1.457738
H  -4.657787 -1.246618 2.013161
H  -4.177117 -2.563385 0.883062
H  -2.854677 -1.898754 -1.214178
H  -2.504019 -0.152089 -1.453348
H  -0.005764 -1.579804 0.083831
H  6.581734 -2.079953 -0.636677
H  6.195872 -0.3174 -0.489988
H  5.020064 0.399697 1.576527
H  4.644171 -0.892101 2.79048
H  -6.576905 -2.044786 0.497419
H  -6.193828 -0.286804 0.299155
H  -4.910866 0.356009 -1.724539
H  -4.459757 -0.978718 -2.86318
H  2.784831 0.802264 -2.462385
H  -2.908399 0.953086 2.38762
H  -2.024309 3.316536 0.871912
H  1.846192 3.236822 -1.322164
H  0.499857 4.106131 0.754224
