program: Gaussian 09
title: 000245507
version: EM64L-G09RevD.01
frameworkgroup: C1[X(C12H13N3)]
method: RPBEPBE
basis: SDD
operation: Freq
keyword: #pfreq=noraman
keyword: PBEPBE/SDD
title: #p freq=noraman PBEPBE/SDD
converged: YES YES NO NO
title: Mulliken charges:
elementType: N N N C C C C C C C C C C C C H H H H H H H H H H H H H
charge: -0.241458 -0.040215 -0.020292 0.439949 0.063950 0.110138 -0.628869 -0.377446 -0.403315 -0.767738 -0.213156 -0.210782 -0.252312 -0.288796 -0.301753 0.245570 0.248765 0.223626 0.263901 0.242645 0.234079 0.251113 0.258616 0.229749 0.227050 0.230681 0.237049 0.239249
chargesum: 0.00000
title: Mulliken charges with hydrogens summed into heavy atoms:
elementType: N N N C C C C C C C C C C C C
charge: -0.241458 -0.040215 -0.020292 0.439949 0.063950 0.110138 0.089091 -0.113545 -0.160670 -0.023929 0.016593 0.016268 -0.021630 -0.051747 -0.062504
polarizability: 2.30454925e+02 -3.87225129e+00 1.31361406e+02 1.61098810e+01 7.54642619e+00 1.00601797e+02
1716.lowfreq: -12.4913 -0.0008 -0.0007 -0.0006 4.4545 9.2100 47.3920 65.5174 77.8216
frequency: 47.2920 65.4488 77.8162 105.4580 135.4489 154.7191 186.5574 229.8400 279.3552 310.7373 326.4937 333.0968 409.5100 425.2379 476.3530 480.3883 536.4618 564.3861 581.2995 599.4087 613.9322 679.3474 701.3621 763.2082 771.1048 814.9942 841.1731 844.1161 895.2634 915.0591 934.8641 959.3736 973.5572 986.0508 990.3061 1020.0345 1038.6908 1042.7679 1061.7464 1083.5040 1108.5938 1127.2174 1157.3073 1171.8622 1185.6224 1244.6188 1253.8467 1269.3755 1315.5104 1337.4664 1377.0866 1392.6185 1401.0389 1413.7927 1440.4391 1448.8057 1452.1540 1455.5207 1463.9922 1476.3209 1492.7569 1497.7788 1520.2812 1586.3951 1609.2956 2985.7927 2989.0073 3066.8658 3082.6074 3111.7194 3124.5503 3126.4594 3130.1897 3131.1737 3145.0676 3151.3661 3162.0063 3168.0732
redmass: 3.8657 3.7234 5.0011 3.4261 1.2891 2.1494 1.1582 3.1637 3.4621 4.3479 3.6588 3.1359 2.9384 5.6404 4.3478 3.7323 3.7632 5.0227 4.3336 6.7238 6.4050 5.6815 1.9194 3.1962 2.1857 4.7627 1.2819 1.2556 3.7231 1.5037 1.4505 1.9163 1.3796 5.9406 1.3084 2.7260 2.2466 1.8620 2.4336 1.5957 1.3440 1.6731 2.7988 1.0521 1.1135 2.0880 4.3657 5.1404 1.3929 2.3560 6.9284 1.5148 1.9240 2.0226 1.9148 1.4348 1.1825 1.0640 1.1861 1.4679 1.5403 5.1593 4.2799 6.3090 6.0854 1.0376 1.0383 1.0953 1.0948 1.1000 1.1013 1.0854 1.0881 1.0880 1.0922 1.0967 1.0986 1.1015
irintensity: 1.6229 1.2327 0.0908 4.1580 0.6400 3.2598 0.1369 1.6080 3.5790 5.3617 0.6910 0.4958 2.1808 5.8896 5.9291 1.6635 11.9560 9.9387 9.3001 0.4024 0.2454 4.7291 50.8925 19.9004 32.5369 1.4539 27.1538 3.6104 11.8551 4.0435 0.9193 10.3887 0.1306 0.1151 0.3520 2.9927 26.4539 2.1162 4.4142 8.7627 13.9780 47.6426 20.5938 0.4234 3.1148 14.5126 36.6010 5.6530 7.4195 24.5419 1.1939 136.3494 180.0790 11.6259 3.9475 73.1299 13.9242 19.0557 18.7313 16.1280 167.8006 1.1623 106.8909 6.9009 58.9076 17.0831 46.9523 10.7166 19.5978 10.9540 22.4605 3.1853 9.0877 1.2412 15.7457 29.8207 49.0267 17.5858
temp: 298.150 k
press: 1.00000 atm
elementType: 7 7 7 6 6 6 6 6 6 6 6 6 6 6 6 1 1 1 1 1 1 1 1 1 1 1 1 1
symmnumber: 1
zpe: 591136.7 jmol-1
zpe.correction: 0.225152 hartree
zpe.thermalcorrener: 0.238419 hartree
zpe.thermalcorrenthalpy: 0.239363 hartree
zpe.thermalcorrgfe: 0.185048 hartree
zpe.sumelectzpe: -628.241565 hartree
zpe.sumelectthermal: -628.228299 hartree
zpe.sumelectthermalent: -628.227355 hartree
zpe.sumelectthermalfe: -628.281670 hartree
dipole: 1.8684 0.9639 0.0579
dipole: 2.1032
quadrupole: -80.8323 -89.3889 -87.1400
quadrupole: -3.2909 3.7650 5.1632
quadrupole: 4.9547 -3.6018 -1.3529 -3.2909 3.7650 5.1632
hfenergy: -628.4667174 hartree
pointgroup: C01 [X(C12H13N3)]
dipole: -0.7594471 -0.291878 -0.1507849 debye
polarizability: 225.9975279|8.0314072|125.3293453|-27.6156459|13.6217887|111.0912557 unknown
InChI: InChI=1S/C12H13N3/c1-10-12(14-9-8-13-10)15(2)11-6-4-3-5-7-11/h3-9H,1-2H3
charge 0 multiplicity 1
28 atoms
N  -0.04132 -1.092703 -0.448373
N  2.134048 -0.707665 -1.273315
N  2.823705 0.811155 1.011418
C  -1.258005 -0.429116 -0.063787
C  1.220705 -0.491848 -0.272331
C  1.596537 0.224092 0.931024
C  -0.139729 -2.160679 -1.476581
C  -1.393535 0.978731 -0.197372
C  -2.358708 -1.185139 0.420428
C  0.732113 0.301288 2.166823
C  -2.602118 1.615307 0.159645
C  -3.568504 -0.544326 0.760456
C  -3.698168 0.859735 0.636302
C  3.366091 -0.14092 -1.142995
C  3.697373 0.660276 -0.032735
H  0.688902 -2.875568 -1.354665
H  -0.077237 -1.743397 -2.498931
H  -1.101747 -2.68205 -1.355964
H  -0.55875 1.565711 -0.596021
H  -2.256884 -2.268137 0.551475
H  0.211631 -0.654988 2.352278
H  1.374852 0.550943 3.025745
H  -0.050381 1.078131 2.081787
H  -2.690283 2.702135 0.050001
H  -4.407015 -1.141044 1.136967
H  -4.637062 1.354954 0.90573
H  4.085386 -0.342443 -1.944114
H  4.670003 1.152563 0.059906
