program: Gaussian 09
title: 000245503
version: EM64L-G09RevD.01
frameworkgroup: C1[X(C10H12O6S)]
method: RPBEPBE
basis: SDD
operation: Freq
keyword: #p
keyword: freq=noraman
keyword: PBEPBE/SDD
title: #p freq=noraman PBEPBE/SDD
converged: NO YES NO YES
title: Mulliken charges:
elementType: S O O O O O O C C C C C C C C C C H H H H H H H H H H H H
charge: 0.353863 -0.247289 -0.387885 -0.379278 -0.447434 -0.258059 -0.225708 -0.380091 -0.419466 0.218569 0.160041 0.311979 0.361678 -0.219985 -0.200562 -0.669171 -0.684592 0.230589 0.230591 0.238697 0.238700 0.208496 0.233030 0.233029 0.229152 0.229999 0.230002 0.389577 0.421527
chargesum: 0.00000
title: Mulliken charges with hydrogens summed into heavy atoms:
elementType: S O O O O O O C C C C C C C C C C
charge: 0.353863 -0.247289 -0.387885 0.010299 -0.025907 -0.258059 -0.225708 -0.380091 -0.419466 0.218569 0.160041 0.311979 0.361678 0.241195 0.276834 0.005385 0.004561
polarizability: 2.48503438e+02 3.03877525e-01 1.61692393e+02 -1.47228983e-02 8.44444907e-03 7.70226864e+01
1716.lowfreq: -0.4667 -0.0018 -0.0010 0.0007 3.6733 10.0260 30.2068 41.2920 60.2686
frequency: 29.8674 41.2510 60.0229 61.0589 75.5998 93.9714 98.9215 104.4423 139.5299 154.8825 175.0296 223.8192 240.4938 250.9234 257.8270 285.7880 288.9032 306.6670 320.8413 345.6341 352.5472 402.7611 428.2753 491.3197 492.8205 493.2333 531.2927 675.3160 682.4082 707.6027 719.9995 734.8537 735.6501 798.5379 799.9738 801.8968 805.0030 812.3045 949.1393 974.2811 986.5422 1029.9599 1032.0187 1094.7569 1111.5376 1113.5238 1133.8726 1138.1906 1196.0132 1248.5758 1249.9446 1250.6595 1275.1933 1314.2635 1359.7298 1367.3209 1402.7998 1403.1699 1461.7429 1468.2407 1472.5823 1476.6955 1484.7972 1485.5380 1491.3401 1540.4180 1574.0386 1618.3293 1658.2817 2994.8613 2997.7474 3009.4148 3021.8319 3068.6160 3078.8109 3092.0992 3094.1344 3107.6878 3111.0870 3211.8504 3487.1506
redmass: 4.4609 3.1306 2.2611 4.2465 4.0596 3.0835 11.1640 4.4643 3.1624 5.2690 6.0068 5.7466 1.2774 1.2346 5.4778 5.4240 9.4987 7.9299 5.1203 5.3902 8.0873 4.6778 6.4205 1.1503 11.6150 7.0131 14.5330 10.4818 7.9843 3.9853 11.0120 9.8302 1.3198 4.4496 1.1042 1.0967 3.8375 5.5975 6.2024 4.8951 4.3808 3.1952 3.4033 8.1270 2.2573 2.2475 1.4575 1.4615 2.4771 1.1361 1.1291 3.3242 1.7296 2.1637 1.4000 1.6442 1.2569 1.2778 1.0397 1.0401 1.0652 1.0653 1.4803 1.0724 2.2271 5.2454 8.2423 7.5827 12.3228 1.0360 1.0361 1.0580 1.0583 1.1069 1.1057 1.0983 1.0985 1.1047 1.1023 1.0646 1.0651
irintensity: 0.8567 0.0304 1.8541 1.0328 0.0137 0.0251 1.0860 0.5505 6.7862 0.2103 1.3173 5.1693 1.1270 0.8730 4.3169 8.8358 0.1115 0.5591 23.3169 0.0700 15.4543 3.5584 0.8267 147.7634 2.6166 6.7647 1.5490 0.7446 10.3463 0.0004 8.9602 12.6771 153.3080 54.8621 3.6492 5.7842 1.5190 6.4497 172.1904 144.6597 11.8585 382.3991 29.8034 242.1230 17.3776 6.4729 5.6738 5.4424 157.0307 0.0001 0.0388 390.8474 162.8892 447.6088 22.9655 66.5422 30.8236 12.0878 11.8052 13.8462 4.4095 13.6653 46.5211 22.9880 42.1686 16.4793 98.4853 156.6534 423.4447 15.6858 22.2946 20.7661 18.8541 9.8765 0.5848 31.5622 29.8438 44.5816 41.4741 343.1181 82.6803
temp: 298.150 k
press: 1.00000 atm
elementType: 16 8 8 8 8 8 8 6 6 6 6 6 6 6 6 6 6 1 1 1 1 1 1 1 1 1 1 1 1
symmnumber: 1
zpe: 554230.2 jmol-1
zpe.correction: 0.211095 hartree
zpe.thermalcorrener: 0.229556 hartree
zpe.thermalcorrenthalpy: 0.230500 hartree
zpe.thermalcorrgfe: 0.163105 hartree
zpe.sumelectzpe: -1236.373342 hartree
zpe.sumelectthermal: -1236.354881 hartree
zpe.sumelectthermalent: -1236.353937 hartree
zpe.sumelectthermalfe: -1236.421332 hartree
dipole: -2.9849 4.7737 0.0008
dipole: 5.6301
quadrupole: -73.4007 -116.6026 -105.5163
quadrupole: -4.3104 -0.0030 -0.0005
quadrupole: 25.1059 -18.0961 -7.0097 -4.3104 -0.0030 -0.0005
hfenergy: -1236.5844374 hartree
pointgroup: C01 [X(C10H12O6S1)]
dipole: 1.1712978 -1.880035 0.0002951 debye
polarizability: 248.5041976|0.1624385|161.6916333|0.0147091|-0.0084684|77.0226864 unknown
InChI: InChI=1S/C10H12O6S/c1-3-15-9(13)7-5(11)6(12)8(17-7)10(14)16-4-2/h11-12H,3-4H2,1-2H3
charge 0 multiplicity 1
29 atoms
S  -0.07324 1.797941 0.00004
O  -3.553018 -0.253954 -0.000071
O  3.487622 -0.19983 0.000553
O  -1.301932 -2.041504 0.000319
O  1.498821 -1.896907 0.000574
O  -3.086291 2.039963 -0.00023
O  3.145587 2.129995 0.000302
C  -1.283823 0.442567 0.000058
C  1.262872 0.583248 0.000291
C  -0.669301 -0.81216 0.00025
C  0.769981 -0.723204 0.000379
C  -2.695146 0.841021 -0.000123
C  2.660792 0.977575 0.000383
C  -5.013305 0.07546 -0.000196
C  4.965019 0.041323 0.000648
C  -5.756691 -1.255468 -0.000071
C  5.648874 -1.321934 0.000755
H  -5.230306 0.686594 -0.89514
H  -5.23041 0.686825 0.894564
H  5.209219 0.638926 0.896354
H  5.209348 0.63885 -0.895072
H  -6.847088 -1.073955 -0.000174
H  -5.5003 -1.848646 -0.894065
H  -5.500429 -1.848409 0.894117
H  6.744814 -1.181146 0.000826
H  5.380795 -1.905355 0.898713
H  5.38092 -1.90543 -0.897191
H  -0.602413 -2.751052 0.000462
H  2.477527 -1.642835 0.000647
