program: Gaussian 09
title: 000245498
version: EM64L-G09RevD.01
frameworkgroup: C1[X(C15H11F2NO)]
method: RPBEPBE
basis: SDD
operation: Freq
keyword: #p
keyword: freq=noraman
keyword: PBEPBE/SDD
title: #p freq=noraman PBEPBE/SDD
converged: NO YES NO YES
title: Mulliken charges:
elementType: F F O N C C C C C C C C C C C C C C C H H H H H H H H H H H
charge: -0.219248 -0.207184 -0.258814 -0.439002 -0.690079 0.321300 0.258758 0.302809 0.185135 -0.547536 -0.536823 -0.581983 -0.349339 0.313719 0.111868 0.348259 -0.388283 0.216369 -0.796142 0.253665 0.253665 0.326418 0.267082 0.270931 0.243982 0.255613 0.336236 0.240126 0.268359 0.240136
chargesum: 0.00000
title: Mulliken charges with hydrogens summed into heavy atoms:
elementType: F F O N C C C C C C C C C C C C C C C
charge: -0.219248 -0.207184 -0.258814 -0.102766 -0.182748 0.321300 0.258758 0.302809 0.185135 -0.221117 -0.269741 -0.311051 -0.105358 0.313719 0.111868 0.348259 -0.132670 0.216369 -0.047520
polarizability: 3.22135588e+02 -5.85666261e+00 1.73979392e+02 5.14564669e-04 4.44892758e-05 7.52267817e+01
1716.lowfreq: -73.3855 -0.0010 -0.0010 0.0001 1.5356 6.4813 7.5656 40.7871 67.0283
frequency: -73.3855 40.7853 67.0255 82.8047 97.5308 120.4373 168.4519 179.1866 210.0158 246.0588 266.1087 273.1788 314.7837 319.7127 394.4647 404.5596 425.2529 434.0577 439.4733 488.1840 518.3394 540.9494 560.0626 580.6630 593.1657 637.5547 643.1488 692.1907 705.3728 717.5025 720.4215 748.4842 776.8615 809.0505 821.2543 859.6845 866.9061 916.4777 919.5018 924.9879 945.5786 957.6213 971.7598 1000.5773 1032.8619 1075.8322 1104.0010 1128.3508 1136.1228 1144.8968 1189.2229 1200.1840 1228.8981 1232.3294 1243.1375 1274.6533 1334.5973 1371.5051 1377.7774 1387.7613 1425.5277 1436.2485 1445.6172 1448.4304 1463.4888 1467.4363 1494.4859 1504.1818 1595.6110 1599.3325 1624.8071 1627.0876 1635.6513 2989.3678 2990.2618 3034.1718 3075.4936 3139.3728 3143.1707 3162.8277 3168.7359 3177.4272 3187.3950 3516.7356
redmass: 1.0399 5.3051 6.1322 5.7238 5.9807 5.0585 7.7403 6.6816 3.1966 7.3738 3.1259 6.7351 8.1952 5.2248 6.5610 4.5829 5.6630 3.2321 3.1358 4.9959 6.7507 3.2860 5.4303 3.1482 5.1739 5.6009 3.9769 1.2886 6.4926 3.2669 5.9359 3.1599 5.3000 4.9013 1.4295 1.5698 1.4630 1.5103 3.3244 6.0466 1.3672 3.0992 1.8518 1.8817 1.6626 3.8308 2.0862 1.5290 1.1433 2.0434 2.5464 1.5461 3.8546 1.5596 2.5617 1.4352 4.9364 3.8010 1.3466 5.0747 1.1456 3.1710 1.7809 3.4493 2.3603 1.0464 4.5265 2.3003 7.8984 6.5644 7.6001 5.6034 6.9572 1.0611 1.0383 1.0993 1.0983 1.0982 1.0899 1.0933 1.0930 1.0959 1.0934 1.0765
irintensity: 0.1416 0.0007 7.2982 5.1914 2.7782 0.3076 4.5809 1.0298 1.9263 1.1440 3.0755 2.1987 0.4219 5.7669 3.4243 0.6130 15.5682 15.7277 0.0055 11.7644 7.7284 3.0859 7.9535 0.1691 8.6480 6.0758 0.1884 78.1027 3.6317 11.0429 2.2144 0.6367 4.6022 15.2821 50.4100 43.2822 11.5050 1.3737 28.9538 0.9648 1.1469 30.2327 33.0536 28.0000 8.3323 36.0420 16.7998 21.1542 0.0202 3.6303 27.9160 8.7018 19.4657 8.6170 183.7065 6.3036 45.1140 86.7785 69.1388 5.6983 6.4615 86.5081 61.1212 143.3339 69.3030 19.7808 15.0743 515.5792 51.8310 28.3037 29.7688 127.6033 31.4424 8.9876 7.6869 5.0347 13.6682 7.2854 7.8583 2.9481 1.0757 6.5755 6.3297 39.3880
temp: 298.150 k
press: 1.00000 atm
elementType: 9 9 8 7 6 6 6 6 6 6 6 6 6 6 6 6 6 6 6 1 1 1 1 1 1 1 1 1 1 1
symmnumber: 1
zpe: 581475.9 jmol-1
zpe.correction: 0.221472 hartree
zpe.thermalcorrener: 0.236556 hartree
zpe.thermalcorrenthalpy: 0.237500 hartree
zpe.thermalcorrgfe: 0.178898 hartree
zpe.sumelectzpe: -906.577261 hartree
zpe.sumelectthermal: -906.562178 hartree
zpe.sumelectthermalent: -906.561234 hartree
zpe.sumelectthermalfe: -906.619835 hartree
dipole: 2.3115 1.9121 0.0000
dipole: 2.9998
quadrupole: -107.0514 -107.0442 -111.1846
quadrupole: 4.9557 -0.0004 -0.0001
quadrupole: 1.3754 1.3825 -2.7579 4.9557 -0.0004 -0.0001
hfenergy: -906.7987336 hartree
pointgroup: C01 [X(C15H11F2N1O1)]
dipole: 0.907009 0.7551678 -0.001028 debye
polarizability: 322.1714678|-5.3836129|173.9433242|0.0096034|-0.1362115|75.2269696 unknown
InChI: InChI=1S/C15H11F2NO/c1-8(19)18-15-6-10-4-9-5-11(16)2-3-12(9)13(10)7-14(15)17/h2-3,5-7,18H,4H2,1H3
charge 0 multiplicity 1
30 atoms
F  2.581368 2.67392 -0.003704
F  -5.960806 -0.765163 0.00095
O  4.151993 -2.072527 0.002876
N  3.745496 0.238279 -0.000301
C  -0.999465 -1.753101 0.00245
C  0.095879 -0.693006 0.00099
C  -0.492161 0.608639 -0.000811
C  -2.277514 -0.923851 0.001276
C  -1.957514 0.470344 -0.000637
C  1.487485 -0.877773 0.001249
C  0.329671 1.758868 -0.00241
C  -3.614612 -1.355189 0.001831
C  -2.982652 1.443027 -0.001991
C  2.330012 0.268986 -0.000338
C  1.709622 1.548652 -0.002116
C  -4.608942 -0.357296 0.00043
C  -4.33188 1.023448 -0.00145
C  4.583055 -0.882361 0.001234
C  6.070967 -0.535344 0.000728
H  -0.935464 -2.411127 0.890723
H  -0.935442 -2.413609 -0.883976
H  1.95012 -1.866167 0.002618
H  -0.067423 2.777638 -0.00384
H  -3.897037 -2.412136 0.003278
H  -2.748326 2.512677 -0.003453
H  -5.15819 1.739921 -0.002454
H  4.195245 1.158185 -0.001598
H  6.344387 0.052576 -0.89492
H  6.648764 -1.470191 0.001862
H  6.344466 0.054781 0.894903
