program: Gaussian 09
title: 000245480
version: EM64L-G09RevD.01
frameworkgroup: C1[X(C15H10F3NO)]
method: RPBEPBE
basis: SDD
operation: Freq
keyword: #p
keyword: freq=noraman
keyword: PBEPBE/SDD
title: #p freq=noraman PBEPBE/SDD
converged: YES YES NO NO
title: Mulliken charges:
elementType: F F F O N C C C C C C C C C C C C C C C H H H H H H H H H H
charge: -0.176947 -0.138801 -0.138899 -0.213304 -0.352615 -0.376133 0.286640 0.285161 0.161344 0.161479 -0.422600 -0.422541 -0.385856 -0.385860 -0.232668 -0.232648 -0.229207 -0.229160 0.188498 0.287762 0.287830 0.348097 0.257322 0.257294 0.243782 0.243795 0.232759 0.232767 0.231361 0.231350
chargesum: 0.00000
title: Mulliken charges with hydrogens summed into heavy atoms:
elementType: F F F O N C C C C C C C C C C C C C C C
charge: -0.176947 -0.138801 -0.138899 -0.213304 -0.004518 -0.088303 0.286640 0.285161 0.161344 0.161479 -0.165278 -0.165248 -0.142073 -0.142065 0.000091 0.000119 0.002154 0.002190 0.188498 0.287762
polarizability: 1.99478999e+02 9.77764875e-02 2.28418674e+02 2.91084830e+01 -2.14211040e-03 9.59445068e+01
1716.lowfreq: -7.7822 -5.4144 -4.0491 -0.0004 -0.0004 0.0006 5.3358 21.1222 36.9935
frequency: 3.5347 21.1183 36.9913 49.3134 92.8628 136.0487 160.0149 170.0224 197.4879 249.5738 270.7560 275.1854 316.0082 371.1493 387.7509 410.3180 427.2689 440.5849 444.2399 493.1940 508.3975 564.7261 571.6609 594.6789 617.2069 624.7356 653.9216 665.3092 706.7579 725.7664 745.2548 746.2026 765.9834 786.0056 792.2045 850.6987 876.8917 888.3285 908.1698 955.5862 956.9742 991.6715 993.3437 995.9359 1006.2344 1020.7006 1030.0142 1035.7660 1038.7853 1095.7284 1108.8824 1129.7414 1169.2022 1172.8986 1186.9823 1197.0069 1201.3010 1238.4810 1243.9882 1296.9595 1300.2790 1314.6013 1376.6030 1404.8773 1440.4538 1445.7672 1467.1229 1483.6099 1490.7503 1594.9356 1595.1201 1618.9205 1619.7662 1646.6806 3000.6757 3127.6165 3128.4890 3134.9147 3136.1768 3147.3088 3148.4670 3165.3903 3166.0307 3530.6285
redmass: 10.4865 15.2527 7.9697 5.3849 4.9679 3.8363 7.4448 6.9944 7.4589 5.9162 5.9201 12.6508 5.2865 11.0804 4.9508 6.0370 3.5431 5.9165 4.5049 8.9510 5.0681 3.2812 5.3659 3.2332 6.2354 7.5981 6.9857 1.4436 9.2852 5.2410 2.8907 1.8124 1.5774 6.4628 2.0123 3.3467 1.4923 1.6607 3.1973 1.4252 1.4981 1.3421 1.3304 6.3239 10.2232 2.2571 2.0540 11.3603 7.3943 2.4773 1.7264 4.1440 1.2249 1.0924 1.5271 2.5673 1.5139 2.1938 1.9462 1.4978 1.8092 1.5507 9.0376 3.5781 2.2143 2.7931 2.6166 4.0244 1.8041 6.5018 7.1642 7.4340 7.1174 10.8520 1.0818 1.0857 1.0856 1.0897 1.0900 1.0949 1.0949 1.1003 1.1003 1.0782
irintensity: 1.8467 1.2273 0.3495 0.4050 0.9313 0.1777 2.4212 2.7835 3.1930 6.1612 1.2703 7.2900 0.0447 3.1917 4.9170 0.6182 12.8652 5.6294 0.8601 8.7853 0.0212 0.6640 38.7802 9.4485 1.3764 7.8770 3.1395 81.6471 2.5586 2.1292 41.1352 0.1599 115.6261 40.1855 0.4109 10.7319 5.0565 0.6354 23.5311 0.0676 2.6709 0.0003 0.0619 3.1948 137.8433 7.0287 19.4648 207.3737 42.8508 60.3924 0.7893 174.1783 1.4575 2.8055 0.3014 36.9464 0.4441 21.4846 2.6133 2.3036 0.4118 5.0041 4.6202 0.2868 32.7425 11.0818 7.9025 0.2581 144.0581 0.8294 0.1697 5.7803 1.3756 313.5969 18.9885 3.4306 1.2503 4.1100 1.3710 2.2057 40.4071 51.4753 7.3374 48.1401
temp: 298.150 k
press: 1.00000 atm
elementType: 9 9 9 8 7 6 6 6 6 6 6 6 6 6 6 6 6 6 6 6 1 1 1 1 1 1 1 1 1 1
symmnumber: 1
zpe: 562829.2 jmol-1
zpe.correction: 0.214370 hartree
zpe.thermalcorrener: 0.230594 hartree
zpe.thermalcorrenthalpy: 0.231538 hartree
zpe.thermalcorrgfe: 0.166253 hartree
zpe.sumelectzpe: -1005.730278 hartree
zpe.sumelectthermal: -1005.714055 hartree
zpe.sumelectthermalent: -1005.713111 hartree
zpe.sumelectthermalfe: -1005.778396 hartree
dipole: -4.8187 -0.0122 -1.9786
dipole: 5.2091
quadrupole: -118.4789 -99.1876 -122.1034
quadrupole: -0.0183 -0.1149 -0.0238
quadrupole: -5.2223 14.0690 -8.8468 -0.0183 -0.1149 -0.0238
hfenergy: -1005.9446484 hartree
pointgroup: C01 [X(C15H10F3N1O1)]
dipole: 1.8668796 -0.2397077 -0.8108216 debye
polarizability: 199.4220662|5.5011198|227.2390701|-29.8342786|9.3630369|97.1810429 unknown
InChI: InChI=1S/C15H10F3NO/c16-15(17,18)14(20)19-13-11-7-3-1-5-9(11)10-6-2-4-8-12(10)13/h1-8,13,19H
charge 0 multiplicity 1
30 atoms
F  -3.346834 0.621295 -1.708519
F  -4.333679 1.83819 -0.06204
F  -4.659369 -0.402661 -0.161158
O  -2.646652 0.364332 1.858505
N  -1.293499 0.247534 -0.060484
C  -0.019861 0.030577 0.654019
C  0.691902 -1.270193 0.264893
C  1.04316 1.093952 0.355244
C  2.028476 -0.991389 -0.145837
C  2.2458 0.470682 -0.089889
C  0.199936 -2.584221 0.294879
C  0.95304 2.488157 0.488122
C  2.88956 -2.043893 -0.522378
C  3.379232 1.253192 -0.396471
C  1.064286 -3.64077 -0.091048
C  2.090714 3.274302 0.171961
C  2.396081 -3.370302 -0.4924
C  3.291246 2.659654 -0.262781
C  -2.479551 0.392896 0.6099
C  -3.702968 0.611909 -0.324647
H  -0.286429 0.028827 1.729971
H  -1.277107 0.289155 -1.083347
H  -0.827427 -2.795253 0.612138
H  0.027571 2.963753 0.831531
H  3.921013 -1.845792 -0.833922
H  4.312318 0.788212 -0.733077
H  0.701583 -4.674205 -0.075808
H  2.043145 4.364429 0.26756
H  3.050412 -4.199546 -0.783275
H  4.161098 3.282677 -0.498643
