program: Gaussian 09
title: 000245460
version: EM64L-G09RevD.01
frameworkgroup: C1[X(C11H21NO2)]
method: RPBEPBE
basis: SDD
operation: Freq
keyword: #p
keyword: freq=noraman
keyword: PBEPBE/SDD
title: #p freq=noraman PBEPBE/SDD
converged: YES YES NO NO
title: Mulliken charges:
elementType: O O N C C C C C C C C C C C H H H H H H H H H H H H H H H H H H H H H
charge: -0.314389 -0.229139 -0.167223 0.012553 -0.105089 0.275362 -0.709005 -0.705249 -0.668874 -0.670613 -0.554894 -0.517467 0.231826 -0.768887 0.187635 0.248152 0.205785 0.270741 0.211950 0.216677 0.204217 0.270250 0.217763 0.213616 0.225428 0.232263 0.217631 0.212430 0.230214 0.275206 0.231188 0.291423 0.236859 0.254120 0.237539
chargesum: 0.00000
title: Mulliken charges with hydrogens summed into heavy atoms:
elementType: O O N C C C C C C C C C C C
charge: -0.314389 -0.229139 -0.167223 0.200189 0.143063 0.275362 -0.020529 -0.014104 -0.012068 -0.008290 -0.049474 0.005144 0.231826 -0.040368
polarizability: 1.58799905e+02 3.85456389e+00 1.32390158e+02 1.82871059e+00 3.59376414e+00 1.10366949e+02
1716.lowfreq: -10.2843 -8.8939 -0.0008 -0.0005 0.0003 4.0350 16.8638 35.1826 54.4307
frequency: 16.4755 35.0044 54.4175 71.5319 78.4596 86.9337 99.7580 155.7859 168.7542 190.8438 196.9131 211.9281 215.0923 225.5050 232.1198 256.6798 310.1659 328.8638 332.4087 376.9101 442.9594 462.1574 471.3615 479.6127 520.7217 569.6489 590.7294 604.1122 706.6598 782.1993 835.3380 852.6890 880.5775 915.3456 921.1026 926.2018 935.5203 938.7807 944.7475 972.0699 1030.0671 1046.2331 1084.5827 1128.8373 1134.8931 1147.7179 1153.8905 1159.4991 1169.6279 1176.3932 1206.4348 1230.0050 1276.2074 1312.6191 1315.0371 1324.8140 1342.2628 1368.7067 1368.8855 1369.4303 1380.0603 1384.0390 1396.4221 1419.2641 1439.0348 1443.1515 1454.3424 1456.5868 1456.9775 1464.1601 1468.2697 1468.8941 1477.0573 1484.7702 1485.5409 1500.9393 1570.2358 1631.1644 2949.6761 2971.6195 2980.6816 2980.8747 2984.3075 2985.4428 2988.3296 3014.0368 3019.0184 3040.3688 3061.4269 3067.1919 3073.4088 3075.2125 3079.3519 3085.2999 3089.3474 3095.9815 3112.1177 3117.7710 3120.8849
redmass: 3.6862 3.6253 3.1177 3.2117 3.0631 1.0923 3.8089 2.2925 2.2582 2.6994 1.0545 1.2825 2.5227 1.1211 1.2740 2.2092 3.6941 2.8528 2.8883 2.5157 2.4850 2.3893 3.0933 3.3217 3.0902 3.4845 2.8504 3.8511 3.3932 1.7488 2.6534 2.4012 2.5224 1.2663 1.1859 2.5289 1.5462 1.4043 1.4672 1.9780 1.9156 1.9075 3.0310 2.2680 1.9689 2.3695 2.2299 1.3517 1.9222 1.9174 2.8613 1.3326 1.6342 1.4428 1.5517 1.5155 1.8148 1.2406 1.2205 1.2354 1.2055 1.2311 1.2225 1.8373 1.0957 1.0659 1.0439 1.0579 1.1095 1.0465 1.0595 1.0568 1.0474 1.0548 1.0562 1.0653 5.6501 7.2926 1.0663 1.0610 1.0383 1.0353 1.0361 1.0363 1.0379 1.0824 1.0923 1.0969 1.0891 1.0948 1.0998 1.0996 1.0990 1.1006 1.0985 1.0949 1.0996 1.0989 1.1006
irintensity: 0.7622 5.1746 1.9742 2.0675 2.1877 0.4736 4.3095 0.2828 0.1702 0.1547 0.0226 0.7949 14.9202 0.9723 1.8028 1.8051 4.0689 2.2280 1.6268 10.2392 6.7384 11.0767 0.6324 4.6160 20.9217 14.5040 8.1470 4.2956 0.6912 6.1957 1.5391 3.3023 5.5832 2.5237 4.4633 2.6385 9.7599 5.2775 0.0489 3.1974 37.5441 5.3593 8.3224 4.4720 31.6347 17.3696 26.9157 23.3641 14.2613 23.7474 37.9004 151.8057 41.3057 64.1821 93.3041 52.7072 23.3744 62.3651 31.3556 3.3042 32.8331 48.6059 6.5623 57.6734 39.6773 20.8865 0.4706 19.7860 39.4906 1.9908 15.0065 9.9385 13.0537 4.3570 4.4911 14.9438 212.5133 89.6765 63.6488 57.3085 5.8342 18.0092 14.7326 40.0334 28.9359 30.3092 7.9350 15.6949 5.6426 13.2937 12.8279 4.7255 68.7856 25.9210 49.7228 53.6686 1.6756 21.5395 14.3894
temp: 298.150 k
press: 1.00000 atm
elementType: 8 8 7 6 6 6 6 6 6 6 6 6 6 6 1 1 1 1 1 1 1 1 1 1 1 1 1 1 1 1 1 1 1 1 1
symmnumber: 1
zpe: 795615.3 jmol-1
zpe.correction: 0.303034 hartree
zpe.thermalcorrener: 0.320891 hartree
zpe.thermalcorrenthalpy: 0.321836 hartree
zpe.thermalcorrgfe: 0.256039 hartree
zpe.sumelectzpe: -635.840829 hartree
zpe.sumelectthermal: -635.822971 hartree
zpe.sumelectthermalent: -635.822027 hartree
zpe.sumelectthermalfe: -635.887823 hartree
dipole: 1.7928 1.3675 -2.2163
dipole: 3.1617
quadrupole: -78.6492 -92.3463 -87.7104
quadrupole: 9.3082 7.6729 -2.4563
quadrupole: 7.5861 -6.1111 -1.4751 9.3082 7.6729 -2.4563
hfenergy: -636.1438624 hartree
pointgroup: C01 [X(C11H21N1O2)]
dipole: -0.6428003 0.5943222 0.883672 debye
polarizability: 158.5564482|-4.9435193|132.407104|-0.4889097|-4.2192758|110.5934602 unknown
InChI: InChI=1S/C11H21NO2/c1-8(2)12(9(3)4)11(14)7-6-10(5)13/h8-9H,6-7H2,1-5H3
charge 0 multiplicity 1
35 atoms
O  -0.046527 -1.820394 -0.11818
O  3.542138 0.979061 -1.212849
N  -1.372991 0.088104 0.020754
C  -2.634318 -0.725362 -0.081695
C  -1.521435 1.575381 0.087268
C  -0.141669 -0.552624 0.01507
C  -2.795639 -1.693005 1.114496
C  -2.750177 -1.45202 -1.442888
C  -2.248196 2.020135 1.38049
C  -2.203975 2.141228 -1.183063
C  1.131791 0.306679 0.168876
C  2.387521 -0.572166 0.285309
C  3.617235 0.013417 -0.403689
C  4.952161 -0.644211 -0.073183
H  -3.456652 0.012251 -0.024142
H  -0.504487 1.996596 0.118338
H  -3.77306 -2.20584 1.047966
H  -1.996466 -2.450365 1.104887
H  -2.75712 -1.145076 2.073422
H  -2.665772 -0.737801 -2.281477
H  -3.732716 -1.954666 -1.514454
H  -1.956051 -2.208403 -1.541705
H  -2.276726 3.123539 1.437624
H  -3.291737 1.657339 1.408649
H  -1.727072 1.638328 2.276319
H  -1.650441 1.844565 -2.091156
H  -2.225207 3.245204 -1.135281
H  -3.24738 1.791354 -1.283399
H  1.046013 0.972965 1.047534
H  1.260002 0.965517 -0.71446
H  2.635511 -0.811266 1.337417
H  2.15915 -1.557549 -0.178655
H  5.301781 -0.286771 0.915533
H  5.708564 -0.377653 -0.827709
H  4.853151 -1.742493 -0.004267
