program: Gaussian 09
title: 000245454
version: EM64L-G09RevD.01
frameworkgroup: C1[X(C11H19NO4)]
method: RPBEPBE
basis: SDD
operation: Freq
keyword: #p
keyword: freq=noraman
keyword: PBEPBE/SDD
title: #p freq=noraman PBEPBE/SDD
converged: YES YES NO NO
title: Mulliken charges:
elementType: O O O O N C C C C C C C C C C C H H H H H H H H H H H H H H H H H H H
charge: -0.244277 -0.273546 -0.295565 -0.263174 -0.150449 -0.365435 -0.372443 -0.301410 -0.291031 0.261011 -0.532049 -0.525973 0.256452 0.036813 -0.682981 -0.684584 0.265598 0.226009 0.230106 0.237782 0.224163 0.202082 0.195046 0.223124 0.235301 0.269288 0.253408 0.286108 0.230530 0.212329 0.251975 0.221825 0.207681 0.230787 0.225496
chargesum: 0.00000
title: Mulliken charges with hydrogens summed into heavy atoms:
elementType: O O O O N C C C C C C C C C C C
charge: -0.244277 -0.273546 -0.295565 -0.263174 -0.150449 0.126173 0.095445 0.124835 0.127140 0.261011 -0.027460 0.013544 0.256452 0.267343 0.003148 -0.020620
polarizability: 1.85751916e+02 -4.24199025e+00 1.27648784e+02 -1.96946491e-03 2.72779747e+00 1.06735586e+02
1716.lowfreq: -13.0642 -0.0007 -0.0004 0.0005 1.7837 7.7630 17.1600 23.8554 38.4650
frequency: 17.0722 23.4386 38.0165 59.8532 65.9293 86.7183 107.9132 139.3691 151.7992 188.4400 193.4820 207.2771 238.2575 275.5339 281.6105 319.2452 349.9519 381.8642 391.8026 408.6580 443.1812 457.0263 507.1483 544.0942 561.5967 570.6730 610.2984 669.1993 753.7075 778.2017 795.5499 820.9732 832.7458 886.4456 897.2247 926.3917 929.5474 940.7173 944.8797 1011.0881 1014.5186 1024.7920 1050.2100 1070.8347 1086.0400 1098.0492 1109.6839 1137.5082 1156.6595 1161.0926 1182.3809 1184.2908 1191.8202 1216.9551 1241.4357 1259.2337 1273.3852 1299.3287 1320.9860 1328.6351 1335.1214 1340.9751 1353.5477 1358.2019 1366.9078 1381.1450 1396.9935 1417.3649 1445.9829 1446.2798 1450.8027 1452.5174 1457.2109 1457.8567 1461.4812 1465.4981 1472.4853 1486.4268 1580.5211 1625.6130 2949.5881 2959.9213 2975.9679 2983.2486 2983.9654 2988.8860 2992.9358 3003.8398 3027.2069 3039.0764 3079.8217 3082.8103 3083.9617 3084.2165 3090.2715 3093.3992 3097.1776 3098.0050 3103.8079
redmass: 4.1139 3.3142 4.6661 4.4589 5.1441 4.7096 3.9000 2.3788 2.8267 4.1694 1.0245 2.2136 1.2469 2.9112 3.3512 2.7816 4.9814 3.5329 1.8812 3.2791 2.8009 2.8218 3.3337 2.5963 3.3426 3.7148 2.4959 4.7929 3.4200 3.8816 3.7302 1.9854 1.6998 2.8671 2.5640 1.2114 3.4575 2.8850 1.5790 2.3532 2.1540 2.6486 2.1547 3.6634 2.9679 1.9091 2.1982 1.8388 1.8934 1.6144 2.6514 1.9195 1.0876 1.5153 1.2786 1.6028 1.2012 1.3167 1.3698 1.2806 1.3919 1.2288 1.3547 1.8119 1.2980 1.2601 1.2325 2.6861 1.0849 1.0921 1.0862 1.1160 1.0527 1.1163 1.1100 1.0471 1.0492 1.0485 7.6762 9.3822 1.0682 1.0680 1.0671 1.0649 1.0607 1.0356 1.0359 1.0651 1.0865 1.0984 1.0954 1.0960 1.0960 1.0994 1.0989 1.0988 1.0936 1.1007 1.1006
irintensity: 0.8677 0.4155 0.9428 1.7289 4.7022 0.4742 3.7858 2.0883 0.5650 0.9775 0.0370 15.8350 2.3912 21.4140 11.8098 3.9158 5.9237 7.8599 1.2086 0.8054 2.8659 2.6169 2.7839 12.6261 27.6641 8.3298 6.7431 1.2054 1.9520 14.9597 13.9061 11.1466 1.4327 5.2730 6.4051 3.8884 80.8432 10.3219 4.0362 14.2814 18.0780 12.8700 37.3187 38.3076 2.6165 223.2823 15.3833 201.7653 22.6343 79.7541 0.8353 2.0991 1.2122 70.2399 177.8566 34.4520 12.3267 68.7081 3.3572 6.5249 6.2109 5.6682 1.7622 54.1502 0.5588 33.5268 15.3574 115.2266 2.2431 19.9571 39.9873 15.4501 6.1782 5.9818 25.6344 3.4197 5.9690 20.2202 282.4516 130.5058 45.8130 48.0919 31.8143 81.6010 13.6839 15.8500 23.7520 33.1254 6.7928 8.7996 8.8390 38.1665 10.8703 6.1307 34.5891 51.2344 15.0396 20.5955 33.1816
temp: 298.150 k
press: 1.00000 atm
elementType: 8 8 8 8 7 6 6 6 6 6 6 6 6 6 6 6 1 1 1 1 1 1 1 1 1 1 1 1 1 1 1 1 1 1 1
symmnumber: 1
zpe: 769712.0 jmol-1
zpe.correction: 0.293168 hartree
zpe.thermalcorrener: 0.310709 hartree
zpe.thermalcorrenthalpy: 0.311653 hartree
zpe.thermalcorrgfe: 0.245078 hartree
zpe.sumelectzpe: -784.948036 hartree
zpe.sumelectthermal: -784.930495 hartree
zpe.sumelectthermalent: -784.929551 hartree
zpe.sumelectthermalfe: -784.996126 hartree
dipole: -1.0498 -1.3891 -1.4280
dipole: 2.2518
quadrupole: -87.0660 -103.4844 -93.6083
quadrupole: 1.3934 -0.8649 1.6021
quadrupole: 7.6536 -8.7648 1.1112 1.3934 -0.8649 1.6021
hfenergy: -785.2412039 hartree
pointgroup: C01 [X(C11H19N1O4)]
dipole: -0.4434954 0.4381831 0.6294373 debye
polarizability: 185.5098119|3.2989146|125.8996293|4.9677747|6.4840372|108.7268458 unknown
InChI: InChI=1S/C11H19NO4/c1-9(2)16-11(14)4-3-10(13)12-5-7-15-8-6-12/h9H,3-8H2,1-2H3
charge 0 multiplicity 1
35 atoms
O  5.18033 0.871604 0.053407
O  -3.554188 -0.367952 -0.115091
O  1.219975 -1.893319 -0.834808
O  -2.224391 1.51669 -0.477492
N  2.604035 -0.395484 0.274889
C  3.807665 -1.196487 -0.049186
C  2.892518 0.839031 1.034305
C  4.849807 -0.315441 -0.760122
C  3.96938 1.668062 0.297272
C  1.349936 -0.833749 -0.139892
C  0.136987 0.018088 0.265256
C  -1.182288 -0.692263 -0.082558
C  -2.331168 0.286967 -0.242303
C  -4.804048 0.452815 -0.336456
C  -5.069512 0.548847 -1.84547
C  -5.90208 -0.270017 0.446188
H  3.487705 -2.038665 -0.685207
H  4.240825 -1.596203 0.889803
H  3.271604 0.570133 2.041661
H  1.981211 1.444817 1.15563
H  5.8022 -0.854092 -0.891216
H  4.463613 0.00539 -1.751364
H  3.559497 2.040121 -0.667275
H  4.295949 2.522281 0.913089
H  0.171458 0.252292 1.345922
H  0.163233 0.990777 -0.265092
H  -1.452121 -1.458687 0.663095
H  -1.049057 -1.244654 -1.033704
H  -4.604933 1.459046 0.077395
H  -5.994921 1.125155 -2.028965
H  -4.238379 1.061901 -2.357753
H  -5.194925 -0.458138 -2.281436
H  -6.856914 0.277544 0.347584
H  -5.645109 -0.335043 1.517268
H  -6.045693 -1.294168 0.05933
