program: Gaussian 09
title: 000245449
version: EM64L-G09RevD.01
frameworkgroup: C1[X(C11H17NO3)]
method: RPBEPBE
basis: SDD
operation: Freq
keyword: #p
keyword: freq=noraman
keyword: PBEPBE/SDD
title: #p freq=noraman PBEPBE/SDD
converged: YES YES NO NO
title: Mulliken charges:
elementType: O O O N C C C C C C C C C C C H H H H H H H H H H H H H H H H H
charge: -0.223052 -0.284824 -0.284621 -0.210164 0.314396 -0.345353 -0.588362 0.037674 0.145550 -0.355706 -0.785313 0.149642 -0.676359 -0.213160 -0.675451 0.245523 0.211549 0.274744 0.273597 0.235916 0.200628 0.234080 0.237602 0.311457 0.219609 0.225817 0.207497 0.225324 0.224931 0.210155 0.228267 0.228407
chargesum: 0.00000
title: Mulliken charges with hydrogens summed into heavy atoms:
elementType: O O O N C C C C C C C C C C C
charge: -0.223052 -0.284824 -0.284621 -0.210164 0.314396 0.111719 -0.040021 0.037674 0.145550 0.080838 -0.002173 0.149642 -0.023435 0.237094 -0.008622
polarizability: 2.08063623e+02 2.06563408e+00 1.37155448e+02 -5.34690212e+00 1.51579688e+00 8.92237024e+01
1716.lowfreq: -9.6621 -0.0007 0.0004 0.0008 1.1163 5.1456 32.9112 42.5392 59.3226
frequency: 32.5489 42.1527 59.2463 74.5312 84.5097 94.3394 99.9212 143.6956 166.1694 175.6750 210.7595 222.8328 248.0384 267.5288 274.2770 280.4718 296.4394 335.5922 358.2043 414.7327 437.2368 509.3180 567.7475 605.4447 622.3481 702.1437 710.5065 732.6865 742.5160 799.2215 800.7966 838.7514 875.8906 889.7404 934.5265 981.4708 1014.1145 1037.6505 1046.9862 1049.7445 1087.0554 1109.1066 1111.6711 1118.2476 1133.5769 1136.4014 1158.7392 1207.6816 1219.5407 1247.1795 1272.9360 1302.1065 1315.0030 1328.2052 1356.6920 1367.6776 1391.1343 1395.0059 1400.4217 1402.0093 1417.2207 1447.3375 1463.4894 1468.5629 1473.8777 1474.6940 1477.3621 1484.4612 1487.7609 1489.1653 1596.6584 1628.7640 1656.9066 2977.6890 2978.7260 2990.3423 2994.2595 3006.0829 3009.7913 3020.2045 3040.6397 3054.8103 3062.7451 3066.9662 3068.0551 3082.3062 3084.0992 3090.5348 3104.6105 3116.0720
redmass: 3.7193 3.4624 2.4662 1.7088 4.8102 3.9364 3.1460 3.5218 1.4109 1.6162 1.1775 3.4910 1.3023 3.4065 3.4391 2.5921 2.4749 4.6717 5.0992 5.6415 4.9053 2.5926 4.4272 3.7981 4.5180 7.0133 5.1932 5.0093 1.1549 1.2756 2.4935 2.0471 1.7047 1.8068 2.4553 2.7006 1.9190 3.1416 3.0702 1.5577 4.9734 2.2100 2.2168 1.1689 3.6811 1.4663 2.3129 1.8715 2.2100 1.1349 1.4422 1.3267 1.4677 2.2891 1.5625 1.7368 1.3360 1.6432 1.4908 1.4002 1.1091 1.0814 1.0405 1.1501 1.0529 1.0581 1.0467 1.0605 1.0713 1.0683 11.0288 7.1301 11.4729 1.0363 1.0387 1.0614 1.0359 1.0581 1.0592 1.0621 1.0992 1.0963 1.1064 1.1023 1.0990 1.1023 1.1009 1.0985 1.1022 1.0984
irintensity: 1.2279 0.1143 0.0984 0.0872 3.6924 0.7023 0.0600 5.9873 4.8392 1.7019 0.1285 7.3903 3.7288 1.5532 1.8851 2.4867 4.9906 1.2465 13.1073 2.4428 5.4329 1.0011 18.9541 1.9511 1.2293 14.3589 22.3817 5.7135 16.5472 4.7254 11.6232 0.9595 23.0535 8.6776 1.9972 127.3733 27.4406 285.3980 5.1452 3.8492 46.8216 11.1223 4.8591 0.9702 124.7504 5.4252 30.5089 308.0076 87.3222 0.0022 28.6021 6.0956 38.0746 43.0111 40.8664 10.4066 49.9200 29.1959 99.2103 69.9178 21.9606 43.2334 12.0672 0.1315 2.5853 6.3761 11.4537 0.8326 11.7693 37.0526 280.3370 287.6946 320.7696 40.3343 21.2605 12.0756 24.6418 25.6241 45.6172 2.6825 0.4980 13.5947 10.6263 7.3557 1.6265 50.9177 40.7427 34.1857 46.7018 0.8361
temp: 298.150 k
press: 1.00000 atm
elementType: 8 8 8 7 6 6 6 6 6 6 6 6 6 6 6 1 1 1 1 1 1 1 1 1 1 1 1 1 1 1 1 1
symmnumber: 1
zpe: 694761.7 jmol-1
zpe.correction: 0.264621 hartree
zpe.thermalcorrener: 0.281572 hartree
zpe.thermalcorrenthalpy: 0.282516 hartree
zpe.thermalcorrgfe: 0.218946 hartree
zpe.sumelectzpe: -708.654528 hartree
zpe.sumelectthermal: -708.637577 hartree
zpe.sumelectthermalent: -708.636633 hartree
zpe.sumelectthermalfe: -708.700203 hartree
dipole: 0.5667 -1.7055 0.1355
dipole: 1.8023
quadrupole: -74.9428 -103.1260 -87.9891
quadrupole: -13.8052 -0.9387 1.4405
quadrupole: 13.7432 -14.4400 0.6968 -13.8052 -0.9387 1.4405
hfenergy: -708.9191487 hartree
pointgroup: C01 [X(C11H17N1O3)]
dipole: -0.2140212 -0.6745641 -0.0441443 debye
polarizability: 208.1053318|-1.1967295|137.0613382|-5.3173799|-2.2348738|89.2761034 unknown
InChI: InChI=1S/C11H17NO3/c1-4-6-12-8(3)9(7-10(12)13)11(14)15-5-2/h4-7H2,1-3H3
charge 0 multiplicity 1
32 atoms
O  -1.831002 2.555912 0.249133
O  2.971817 0.255532 -0.139927
O  2.239777 -1.957827 0.072114
N  -1.601049 0.200923 0.372589
C  -0.548592 -0.74498 0.311657
C  -3.039838 -0.084321 0.502823
C  0.409914 1.404796 0.079467
C  0.660568 -0.089782 0.138949
C  -1.108084 1.526664 0.234647
C  -3.744347 -0.286422 -0.860935
C  -0.820607 -2.213929 0.449579
C  1.968764 -0.722674 0.030756
C  -5.25138 -0.563279 -0.679529
C  4.362182 -0.267046 -0.269074
C  5.275362 0.943705 -0.435734
H  -3.490644 0.782954 1.019127
H  -3.175087 -0.975175 1.142754
H  0.923662 1.962027 0.8835
H  0.738036 1.863122 -0.870741
H  -3.596401 0.623207 -1.4720
H  -3.268096 -1.124423 -1.406302
H  -1.557122 -2.559273 -0.299488
H  -1.232802 -2.448203 1.449924
H  0.119946 -2.76922 0.318875
H  -5.750599 0.277489 -0.163048
H  -5.748479 -0.699852 -1.656154
H  -5.424218 -1.478656 -0.082365
H  4.601439 -0.856208 0.635128
H  4.401546 -0.949132 -1.138137
H  6.32462 0.610863 -0.536829
H  5.005899 1.520607 -1.337167
H  5.206511 1.613603 0.438611
