program: Gaussian 09
title: 000245444
version: EM64L-G09RevD.01
frameworkgroup: C1[X(C11H16O4)]
method: RPBEPBE
basis: SDD
operation: Freq
keyword: #pfreq=noraman
keyword: PBEPBE/SDD
title: #p freq=noraman PBEPBE/SDD
converged: YES YES NO NO
title: Mulliken charges:
elementType: O O O O C C C C C C C C C C C H H H H H H H H H H H H H H H H
charge: -0.273830 -0.249669 -0.164330 -0.245603 -0.293231 -0.023905 -0.468037 -0.466073 -0.420791 -0.476112 -0.497572 0.136737 -0.329689 -0.291934 0.239547 0.289532 0.237061 0.246953 0.233578 0.220463 0.257608 0.230548 0.215966 0.236894 0.233469 0.249805 0.259460 0.253070 0.237230 0.222214 0.200640
chargesum: 0.00000
title: Mulliken charges with hydrogens summed into heavy atoms:
elementType: O O O O C C C C C C C C C C C
charge: -0.273830 -0.249669 -0.164330 -0.245603 -0.003698 0.213156 0.012494 0.011999 0.025723 -0.005750 0.011694 0.136737 0.160611 0.130920 0.239547
polarizability: 1.62532737e+02 4.01595662e+00 1.15842931e+02 1.68592982e+00 -4.82986036e-01 1.00442763e+02
1716.lowfreq: -14.9409 -0.0011 -0.0010 -0.0010 2.3831 9.6361 25.4996 34.6414 49.0054
frequency: 24.6621 34.5771 45.9766 55.3879 82.1807 92.3878 129.3890 163.8426 201.5545 244.8589 248.2967 275.2314 316.9974 393.6805 421.5310 468.4338 484.3446 559.7986 590.6624 592.8663 635.5171 684.0384 703.1767 744.9806 819.1296 828.1883 830.9996 857.4680 862.2825 890.4774 899.6574 912.4825 918.4684 930.5665 980.5725 994.7740 1002.5483 1022.4791 1028.3794 1072.9655 1086.1918 1096.3023 1120.1603 1130.2278 1150.2200 1155.1209 1165.4257 1173.8815 1198.2148 1218.6529 1232.5508 1244.2329 1262.0316 1271.7887 1286.3176 1302.0985 1310.8449 1312.7447 1321.4941 1330.8705 1343.2408 1369.0519 1427.4830 1454.2008 1466.0574 1475.7022 1475.9298 1483.9525 1491.7462 1624.6293 1668.4002 2979.2205 2988.6410 3006.3846 3011.5706 3013.1963 3015.1936 3018.2286 3032.0899 3042.8213 3063.9511 3073.8093 3078.6606 3085.9388 3089.5299 3098.8238 3125.5482
redmass: 4.8414 4.9174 3.8570 3.1103 6.8520 3.5431 5.7714 3.0042 2.5735 2.8114 2.5797 4.3289 4.1392 2.4624 3.6490 3.3385 4.2455 3.6596 1.9960 2.5187 5.0093 4.9284 5.6886 3.0677 2.5315 2.0484 2.7008 3.7853 2.3374 1.7993 1.7179 2.2956 2.6377 2.9294 1.6644 2.6119 1.6653 1.8924 3.0619 2.0396 1.5627 2.4989 4.7016 1.4233 1.6818 1.5823 1.5375 1.7812 1.4408 1.2731 1.2704 1.3125 1.2360 1.3612 1.5142 1.3961 1.3406 1.2747 1.5212 1.3492 1.3739 1.4148 1.0811 1.0946 1.0911 1.0929 1.0812 1.0941 1.0957 8.9418 12.4991 1.0648 1.0661 1.0642 1.0723 1.0682 1.0718 1.0618 1.0807 1.0611 1.0997 1.0964 1.0994 1.1019 1.1042 1.1042 1.1083
irintensity: 0.0602 3.0587 0.6918 4.0526 3.0256 3.1874 0.7631 0.0471 0.5987 5.7209 5.7690 2.1149 23.3382 4.6770 6.5463 6.9832 3.0615 3.7047 5.3871 3.4219 11.6800 4.7443 3.6724 3.8799 10.1386 30.6006 3.3621 4.7137 7.5207 5.2760 0.9642 5.4427 19.7013 83.5553 10.9647 46.7549 11.8343 3.4057 87.3652 20.8918 53.6068 247.4852 22.6736 1.0020 33.7943 0.4137 64.6339 9.9165 11.3790 11.2319 14.7872 67.8482 3.4920 2.6534 80.7586 9.8077 7.2149 5.0848 21.5763 18.0962 7.8918 16.0364 22.6946 14.3915 10.5634 21.6503 11.9221 5.8600 1.9659 185.7147 131.4593 93.2217 7.8884 37.6157 2.4846 14.9182 16.4014 20.0157 27.2509 31.8238 31.8931 16.9557 17.1854 22.5761 30.9664 40.9566 8.1548
temp: 298.150 k
press: 1.00000 atm
elementType: 8 8 8 8 6 6 6 6 6 6 6 6 6 6 6 1 1 1 1 1 1 1 1 1 1 1 1 1 1 1 1
symmnumber: 1
zpe: 672416.1 jmol-1
zpe.correction: 0.256110 hartree
zpe.thermalcorrener: 0.270842 hartree
zpe.thermalcorrenthalpy: 0.271786 hartree
zpe.thermalcorrgfe: 0.211767 hartree
zpe.sumelectzpe: -728.486710 hartree
zpe.sumelectthermal: -728.471977 hartree
zpe.sumelectthermalent: -728.471033 hartree
zpe.sumelectthermalfe: -728.531053 hartree
dipole: -1.1515 -3.9322 -1.2127
dipole: 4.2730
quadrupole: -75.0656 -96.4445 -89.0075
quadrupole: 0.6534 5.7512 1.8304
quadrupole: 11.7736 -9.6053 -2.1683 0.6534 5.7512 1.8304
hfenergy: -728.7428197 hartree
pointgroup: C01 [X(C11H16O4)]
dipole: 0.2213966 -1.0741397 -1.2741234 debye
polarizability: 160.3584746|-8.1843906|103.5239611|-7.3681835|6.2748818|114.9359947 unknown
InChI: InChI=1S/C11H16O4/c12-10-5-1-4-9(10)11(13)15-7-8-3-2-6-14-8/h8-9H,1-7H2
charge 0 multiplicity 1
31 atoms
O  -4.025374 0.227521 1.545392
O  -0.354604 -0.362411 1.090639
O  2.791822 0.800456 1.531499
O  0.023363 0.667804 -0.976858
C  1.708602 -0.848725 -0.014348
C  -2.84106 -0.490912 0.994185
C  2.222471 -1.33047 -1.392214
C  -3.137902 -0.711444 -0.507384
C  3.769681 -1.365556 -1.240338
C  -4.051681 0.490942 -0.862576
C  4.088525 -0.122579 -0.378815
C  2.865603 0.061996 0.528134
C  -1.623017 0.405757 1.28727
C  -4.900409 0.647296 0.415139
C  0.388478 -0.102881 -0.057015
H  1.613399 -1.684467 0.705623
H  -2.73669 -1.440308 1.550428
H  1.924419 -0.593602 -2.160701
H  1.80085 -2.308721 -1.67779
H  -3.684766 -1.66194 -0.644926
H  -2.221323 -0.738214 -1.118272
H  4.282736 -1.351286 -2.216427
H  4.082612 -2.285505 -0.711513
H  -3.442564 1.393892 -1.046476
H  -4.668956 0.304058 -1.757363
H  4.168954 0.787178 -1.00849
H  5.013242 -0.184451 0.219452
H  -1.618033 0.691724 2.350048
H  -1.609775 1.302016 0.643887
H  -5.221702 1.684217 0.613281
H  -5.790205 -0.013382 0.394831
