program: Gaussian 09
title: 000245447
version: EM64L-G09RevD.01
frameworkgroup: C1[X(C11H16O5)]
method: RPBEPBE
basis: SDD
operation: Freq
keyword: #pfreq=noraman
keyword: PBEPBE/SDD
title: #p freq=noraman PBEPBE/SDD
converged: YES YES NO NO
title: Mulliken charges:
elementType: O O O O O C C C C C C C C C C C H H H H H H H H H H H H H H H H
charge: -0.275112 -0.217815 -0.186549 -0.258857 -0.230894 0.218393 -0.493831 -0.454044 -0.436529 -0.432729 0.150717 0.172424 -0.686847 0.314171 -0.263081 -0.661956 0.243415 0.235802 0.250435 0.239336 0.219871 0.226811 0.222021 0.220611 0.233508 0.240765 0.236482 0.237684 0.227841 0.222186 0.230157 0.255613
chargesum: 0.00000
title: Mulliken charges with hydrogens summed into heavy atoms:
elementType: O O O O O C C C C C C C C C C C
charge: -0.275112 -0.217815 -0.186549 -0.258857 -0.230894 0.218393 -0.014614 0.035726 0.010152 0.009904 0.150717 0.172424 0.023909 0.314171 0.202445 0.046001
polarizability: 1.64553024e+02 2.96679725e+00 1.15631310e+02 -8.48881026e+00 -2.77049885e+00 1.14873095e+02
1716.lowfreq: -19.0769 -11.7832 -6.8582 0.0003 0.0004 0.0011 7.4787 16.1966 45.2619
frequency: -15.2470 15.5076 45.2347 57.5235 83.1323 102.6868 152.5675 182.4768 202.4347 217.6056 235.0791 235.5929 273.6297 284.3873 302.2813 324.0318 346.6157 388.1836 407.4089 449.5346 532.2900 560.6878 574.1722 626.5227 671.4342 683.5243 700.4174 715.7145 756.7649 785.2521 815.9506 823.6935 826.4033 832.6130 861.8167 892.5653 908.9565 935.9662 958.6237 984.0584 1003.7097 1033.6710 1050.2356 1077.1972 1090.7484 1100.0482 1104.2266 1132.3366 1155.6946 1167.3506 1192.2342 1206.2867 1228.4841 1233.6046 1245.5062 1273.6002 1288.5889 1306.4105 1312.5388 1320.9447 1350.9249 1393.6534 1398.5909 1446.0644 1446.4933 1455.2621 1456.5469 1458.4335 1464.1767 1470.0152 1479.5660 1484.4084 1631.0027 1717.6705 2996.3072 3001.1337 3003.6567 3004.3142 3018.7180 3032.9896 3035.9783 3065.2161 3074.9189 3090.4265 3091.5832 3098.4032 3104.0128 3124.4476 3125.4958 3129.1832
redmass: 2.5666 4.7022 3.0848 4.7468 5.0006 4.3235 3.1126 1.9746 1.0789 3.4198 2.3778 1.4971 2.4277 4.5430 3.2939 5.4302 4.9114 3.1378 5.2853 3.5782 2.5849 3.3146 4.7981 5.2207 7.3338 4.6742 2.9027 9.5503 2.7665 2.2676 1.5512 2.1439 4.3607 5.2475 2.0097 2.7871 2.5255 1.7922 1.9695 3.3971 2.5044 1.8369 1.9365 1.8251 2.6020 2.4039 4.1629 2.3127 1.6797 1.9411 2.3813 2.4270 1.4803 4.4510 1.4606 1.1250 1.2795 1.3312 1.3199 1.5106 1.2849 1.2282 1.2561 1.0817 1.0839 1.0460 1.0891 1.0617 1.0425 1.0845 1.0987 1.0515 10.3735 12.8031 1.0362 1.0606 1.0670 1.0602 1.0355 1.0599 1.0626 1.0990 1.1029 1.1024 1.0975 1.1030 1.1042 1.1063 1.1011 1.1003
irintensity: 0.2092 1.2748 0.5675 0.0028 2.7360 0.5002 1.5647 2.6460 0.8972 1.3974 2.5741 1.2460 2.9369 4.0454 13.2483 3.8596 6.9763 2.1956 3.6157 7.7041 2.5269 0.8410 15.1816 1.5867 8.7438 6.4393 3.9890 7.8051 3.3432 4.1326 8.5926 17.3090 11.8560 44.6703 4.1884 16.1170 13.1129 15.8777 9.2657 247.6900 34.1908 36.3206 6.4471 4.0068 329.2592 90.7336 7.3349 80.1880 36.6304 6.9183 5.9584 22.6539 1.7787 146.5702 37.6435 4.4567 3.4111 1.9618 2.4910 0.3433 0.1573 25.2349 36.1300 21.1058 3.1838 11.0855 9.2957 12.9788 14.7525 10.6890 5.0975 12.9296 132.6831 252.2344 16.9159 36.0585 25.2609 19.0528 4.7030 26.1263 12.4274 23.9258 34.3192 17.3673 29.9600 0.8825 22.4240 27.5898 14.7139 9.3150
temp: 298.150 k
press: 1.00000 atm
elementType: 8 8 8 8 8 6 6 6 6 6 6 6 6 6 6 6 1 1 1 1 1 1 1 1 1 1 1 1 1 1 1 1
symmnumber: 1
zpe: 675449.6 jmol-1
zpe.correction: 0.257265 hartree
zpe.thermalcorrener: 0.272861 hartree
zpe.thermalcorrenthalpy: 0.273805 hartree
zpe.thermalcorrgfe: 0.213261 hartree
zpe.sumelectzpe: -803.647380 hartree
zpe.sumelectthermal: -803.631784 hartree
zpe.sumelectthermalent: -803.630840 hartree
zpe.sumelectthermalfe: -803.691384 hartree
dipole: 2.2331 -1.7715 -3.4724
dipole: 4.4925
quadrupole: -75.7464 -93.6455 -104.1490
quadrupole: -0.0621 2.6749 -4.9659
quadrupole: 15.4339 -2.4652 -12.9687 -0.0621 2.6749 -4.9659
hfenergy: -803.9046451 hartree
pointgroup: C01 [X(C11H16O5)]
dipole: 0.8146947 -1.4329413 -0.6378973 debye
polarizability: 163.7126163|-4.7120341|112.8441672|-9.9570544|-0.4890068|118.5006456 unknown
InChI: InChI=1S/C11H16O5/c1-3-14-8(12)10(2)15-9(13)11(16-10)6-4-5-7-11/h3-7H2,1-2H3
charge 0 multiplicity 1
32 atoms
O  -0.525265 -0.630532 -1.120916
O  0.23011 1.539615 -0.571091
O  -1.538737 2.258176 0.764632
O  2.811553 -0.849343 -0.751295
O  1.494225 -0.389632 1.118786
C  -1.512879 -0.069961 -0.139862
C  -2.922143 -0.086489 -0.791083
C  -1.633728 -0.956065 1.146089
C  -3.540182 -1.424221 -0.324284
C  -3.089784 -1.503204 1.156369
C  -0.998794 1.353897 0.117237
C  0.668355 0.238159 -1.131547
C  1.157508 0.421651 -2.554121
C  1.693498 -0.345567 -0.115289
C  3.862186 -1.465284 0.129869
C  4.801546 -0.387573 0.674634
H  -2.851135 0.031942 -1.884822
H  -3.503723 0.760612 -0.379455
H  -1.381797 -0.388057 2.056311
H  -0.895998 -1.770228 1.052206
H  -3.111771 -2.263358 -0.904355
H  -4.637283 -1.448678 -0.445377
H  -3.736763 -0.85315 1.775123
H  -3.145174 -2.524813 1.570962
H  2.048927 1.068625 -2.578194
H  1.422667 -0.555924 -2.986382
H  0.352938 0.881091 -3.150463
H  3.353795 -2.011437 0.943593
H  4.375987 -2.168962 -0.54345
H  5.612399 -0.86463 1.255535
H  5.260032 0.18921 -0.146706
H  4.262131 0.30423 1.342549
