program: Gaussian 09
title: 000245432
version: EM64L-G09RevD.01
frameworkgroup: C1[X(C10H16O4)]
method: RPBEPBE
basis: SDD
operation: Freq
keyword: #pfreq=noraman
keyword: PBEPBE/SDD
title: #p freq=noraman PBEPBE/SDD
converged: YES YES NO NO
title: Mulliken charges:
elementType: O O O O C C C C C C C C C C H H H H H H H H H H H H H H H H
charge: -0.245385 -0.170571 -0.240267 -0.272081 -0.291190 -0.468645 -0.420158 -0.496786 0.133535 0.244199 -0.263269 -0.251877 -0.205713 -0.677633 0.289663 0.247954 0.235838 0.229662 0.214498 0.248996 0.257753 0.222093 0.245544 0.185459 0.210739 0.192240 0.184401 0.202311 0.227952 0.230738
chargesum: 0.00000
title: Mulliken charges with hydrogens summed into heavy atoms:
elementType: O O O O C C C C C C C C C C
charge: -0.245385 -0.170571 -0.240267 -0.272081 -0.001527 0.015147 0.024002 0.009964 0.133535 0.244199 0.204368 0.144322 0.170928 -0.016632
polarizability: 1.49084824e+02 4.08447448e+00 1.06364408e+02 1.19662314e+00 2.09156713e+00 1.04257626e+02
1716.lowfreq: -13.5095 -11.4906 -1.2395 0.0003 0.0005 0.0009 16.8334 28.8359 41.0115
frequency: 9.9917 28.6938 40.8758 50.8002 58.7160 97.0318 110.2900 145.4192 173.9080 202.8024 221.1411 235.0730 261.0519 278.2941 358.2118 410.8987 433.4825 472.8172 486.4682 555.4512 592.1867 638.8583 722.2038 755.6986 789.8468 810.5152 819.0597 828.7750 898.0670 907.2789 922.8598 933.0204 985.8909 1011.0868 1022.3348 1036.6924 1073.0199 1074.8569 1101.6037 1102.3316 1126.4201 1129.5763 1140.9900 1150.4935 1167.0566 1197.0794 1200.7448 1243.2094 1250.1014 1253.7105 1270.7932 1286.8813 1309.2959 1322.2941 1339.8496 1363.5745 1390.8260 1411.7885 1426.5243 1450.1169 1458.8479 1460.9384 1477.4548 1479.7069 1484.5891 1493.5146 1626.5212 1665.3687 2914.0966 2925.4337 2963.8806 2981.8956 2988.4422 2995.0516 3005.2031 3010.0422 3015.3829 3022.9058 3072.9883 3078.8810 3090.5617 3091.8642 3093.0179 3101.8336
redmass: 4.7841 3.7050 5.2144 2.4776 2.3397 4.8010 4.5739 3.4233 3.6162 2.3562 3.1488 1.2561 2.7818 3.3017 3.7909 2.8027 3.7940 3.4419 3.2086 3.5266 2.5838 4.8297 4.4568 3.4404 2.5018 2.1156 1.3812 2.0292 1.7458 2.1981 2.4262 2.4368 1.8917 2.2371 1.9654 2.5481 1.9015 3.2289 3.2367 2.5377 3.0079 2.6646 1.5448 1.6281 1.6336 1.4150 1.1325 1.3342 1.1151 1.1364 1.3643 1.5183 1.3583 1.5469 1.2553 1.4359 1.2457 1.5353 1.0803 1.0817 1.0409 1.0853 1.0805 1.0484 1.0942 1.0790 9.9065 12.5222 1.0561 1.0585 1.1059 1.1002 1.0659 1.0358 1.0645 1.0800 1.0645 1.0593 1.0957 1.0996 1.1043 1.1067 1.0991 1.1010
irintensity: 1.3671 1.3001 2.7723 7.1430 0.2936 2.8470 6.2634 1.0856 1.0894 4.5774 3.9474 1.9100 3.1194 8.1354 0.4511 2.8257 3.4840 15.1800 2.0291 7.6610 2.3628 10.6017 1.9237 1.4555 5.0840 9.8632 0.2526 27.4874 1.7913 1.2010 9.8776 76.9659 10.2640 23.4936 1.8475 26.6441 5.7087 181.0777 232.8707 32.1074 40.0360 12.1024 9.8946 33.3637 94.3761 21.1767 2.3032 72.6000 5.7226 2.9261 2.4031 102.4875 10.7737 36.1372 22.8240 9.0831 24.2106 2.4450 22.4238 13.6891 11.4647 15.4270 14.3829 3.2433 6.5920 5.7360 234.1100 125.3827 40.5969 105.8972 69.4683 32.4141 8.3068 22.9669 37.8628 0.0232 18.2914 26.4357 16.7794 20.6153 27.8722 18.6807 36.9614 37.6218
temp: 298.150 k
press: 1.00000 atm
elementType: 8 8 8 8 6 6 6 6 6 6 6 6 6 6 1 1 1 1 1 1 1 1 1 1 1 1 1 1 1 1
symmnumber: 1
zpe: 649496.6 jmol-1
zpe.correction: 0.247380 hartree
zpe.thermalcorrener: 0.262894 hartree
zpe.thermalcorrenthalpy: 0.263838 hartree
zpe.thermalcorrgfe: 0.200758 hartree
zpe.sumelectzpe: -690.433194 hartree
zpe.sumelectthermal: -690.417681 hartree
zpe.sumelectthermalent: -690.416736 hartree
zpe.sumelectthermalfe: -690.479816 hartree
dipole: -0.4974 1.7423 -0.8045
dipole: 1.9825
quadrupole: -62.7302 -82.2682 -91.2446
quadrupole: 10.6556 4.1562 -2.0102
quadrupole: 16.0175 -3.5205 -12.4969 10.6556 4.1562 -2.0102
hfenergy: -690.6805743 hartree
pointgroup: C01 [X(C10H16O4)]
dipole: 0.2660748 -0.61886 -0.393169 debye
polarizability: 147.7569663|8.5168383|108.1636833|-0.0317815|-1.7532757|103.7862081 unknown
InChI: InChI=1S/C10H16O4/c1-2-13-6-7-14-10(12)8-4-3-5-9(8)11/h8H,2-7H2,1H3
charge 0 multiplicity 1
30 atoms
O  0.692562 0.182981 0.208464
O  -2.064493 0.953273 -1.570364
O  -0.833253 0.474324 1.947972
O  3.688733 0.032953 0.224251
C  -1.427698 -0.902059 -0.011541
C  -2.370989 -1.826787 0.79389
C  -3.600821 -2.031746 -0.134725
C  -3.801716 -0.650554 -0.798789
C  -2.395195 -0.045811 -0.897672
C  -0.526373 -0.026477 0.840139
C  1.634864 1.111261 0.897989
C  2.873837 1.232819 0.030405
C  4.871062 0.011161 -0.649675
C  5.644455 -1.270381 -0.341934
H  -0.790841 -1.474106 -0.714138
H  -2.666838 -1.307483 1.724106
H  -1.886234 -2.776193 1.075723
H  -4.49002 -2.371078 0.422473
H  -3.377223 -2.794397 -0.90439
H  -4.400418 0.019247 -0.147875
H  -4.292118 -0.664778 -1.78685
H  1.130263 2.085848 1.025728
H  1.883784 0.700569 1.891802
H  3.44557 2.138618 0.337205
H  2.580823 1.349386 -1.035485
H  4.549926 0.038016 -1.714994
H  5.498947 0.911243 -0.458768
H  6.543139 -1.343085 -0.98116
H  5.96193 -1.285744 0.714918
H  5.009836 -2.154419 -0.524905
