program: Gaussian 09
title: 000245433
version: EM64L-G09RevD.01
frameworkgroup: C1[X(C10H16O4)]
method: RPBEPBE
basis: SDD
operation: Freq
keyword: #pfreq=noraman
keyword: PBEPBE/SDD
title: #p freq=noraman PBEPBE/SDD
converged: YES YES NO NO
title: Mulliken charges:
elementType: O O O O C C C C C C C C C C H H H H H H H H H H H H H H H H
charge: -0.291227 -0.289601 -0.270483 -0.240666 0.381531 -0.522536 -0.214287 -0.521543 -0.445887 -0.312517 -0.327624 0.231313 -0.262134 -0.663085 0.250899 0.255847 0.256393 0.263761 0.230571 0.219875 0.248675 0.227144 0.208049 0.231697 0.208491 0.235313 0.221515 0.216090 0.225972 0.248452
chargesum: 0.00000
title: Mulliken charges with hydrogens summed into heavy atoms:
elementType: O O O O C C C C C C C C C C
charge: -0.291227 -0.289601 -0.270483 -0.240666 0.381531 -0.015790 0.042106 -0.027210 0.022663 0.122676 0.112564 0.231313 0.194695 0.027428
polarizability: 1.40383583e+02 5.68833498e-01 1.08768331e+02 -3.74123965e-01 -2.33728812e+00 9.83108339e+01
1716.lowfreq: -21.5249 -9.5052 -0.0010 -0.0007 -0.0003 7.2020 22.3302 30.7080 48.7323
frequency: 20.9725 30.1605 48.3253 64.6681 90.7100 104.1248 162.8172 202.3471 231.7803 270.8306 323.6123 329.7833 351.8286 378.6753 409.8452 436.6557 445.0201 578.2299 608.7277 619.0879 665.1513 712.5471 741.7743 752.1456 790.5810 817.2254 836.5947 848.4704 869.5217 917.1811 930.2977 961.8111 974.4920 978.0132 987.0361 1012.8858 1021.2397 1075.5870 1083.0473 1095.5667 1104.8298 1127.9959 1143.6899 1156.4700 1159.3112 1171.6353 1182.0953 1200.4525 1211.0241 1238.8615 1276.8320 1279.6148 1300.3662 1319.4146 1323.5714 1325.8327 1333.4075 1358.3373 1391.1480 1445.7919 1448.0430 1456.8751 1460.2727 1463.8737 1466.8962 1471.3085 1484.6396 1630.8678 2980.7344 2987.6788 2992.3709 3010.6026 3022.8502 3024.7444 3029.7398 3039.1574 3086.6264 3087.2282 3089.7482 3092.3828 3098.0262 3100.7838 3110.9739 3118.3839
redmass: 4.0391 4.6128 3.6390 3.5778 3.8360 3.1286 3.4882 1.4930 1.6437 2.0022 3.1848 2.7866 3.7049 2.6449 4.7696 3.3159 3.7725 3.1478 2.5698 3.7198 3.8201 4.2443 3.1202 3.0220 2.9224 1.7298 2.4451 2.3146 2.3478 3.3154 2.3150 2.2197 3.1740 1.8471 3.2315 2.2770 2.2350 2.2898 1.8228 2.1763 1.7035 4.1620 2.4132 1.7228 1.1555 1.8945 1.4639 1.2951 1.5770 1.4577 1.3365 1.1273 1.4853 1.3395 1.6684 1.2573 1.4172 1.3316 1.2341 1.0845 1.0785 1.1035 1.0885 1.0446 1.0900 1.0981 1.0513 9.3721 1.0693 1.0615 1.0360 1.0671 1.0666 1.0674 1.0592 1.0690 1.1010 1.0975 1.0990 1.1033 1.1041 1.1024 1.1026 1.1061
irintensity: 0.5460 0.8728 7.1640 2.4856 1.3610 1.7758 1.5788 2.6539 0.8850 1.7016 8.5832 14.5638 3.0299 5.2984 8.9486 3.0087 8.2129 2.7768 3.0003 0.9524 6.8797 2.0795 28.1121 7.5278 9.8114 1.3455 5.3873 7.1456 0.7183 38.9407 6.4818 5.2393 14.3122 46.8418 9.0152 33.5548 76.9581 140.8150 39.6726 34.9191 26.9840 240.8448 21.3821 12.7710 4.1170 63.9739 3.2644 7.3039 19.3210 1.5359 0.3438 3.5243 18.1523 10.3358 30.4202 8.2228 16.7385 3.4413 23.8517 13.1113 18.3053 10.3933 13.7259 14.6935 5.6767 1.4960 12.5197 139.4103 57.4782 74.5307 21.1856 24.0756 29.9928 9.9453 28.9068 14.7461 12.1870 34.4884 31.1307 1.4107 20.3553 32.2048 5.8808 32.8760
temp: 298.150 k
press: 1.00000 atm
elementType: 8 8 8 8 6 6 6 6 6 6 6 6 6 6 1 1 1 1 1 1 1 1 1 1 1 1 1 1 1 1
symmnumber: 1
zpe: 655463.0 jmol-1
zpe.correction: 0.249653 hartree
zpe.thermalcorrener: 0.263834 hartree
zpe.thermalcorrenthalpy: 0.264778 hartree
zpe.thermalcorrgfe: 0.206368 hartree
zpe.sumelectzpe: -690.434273 hartree
zpe.sumelectthermal: -690.420092 hartree
zpe.sumelectthermalent: -690.419147 hartree
zpe.sumelectthermalfe: -690.477558 hartree
dipole: 0.7137 -1.3738 1.1139
dipole: 1.9072
quadrupole: -67.2441 -79.9000 -88.0077
quadrupole: -0.3450 -5.1628 1.3170
quadrupole: 11.1399 -1.5161 -9.6237 -0.3450 -5.1628 1.3170
hfenergy: -690.6839256 hartree
pointgroup: C01 [X(C10H16O4)]
dipole: -0.2880613 0.6779183 0.1430963 debye
polarizability: 140.3572933|1.0605651|108.4816146|-0.3759571|-2.9452157|98.62384 unknown
InChI: InChI=1S/C10H16O4/c1-2-12-9(11)8-3-4-10(7-8)13-5-6-14-10/h8H,2-7H2,1H3
charge 0 multiplicity 1
30 atoms
O  -1.787095 0.688138 -1.108479
O  -2.857392 0.124267 0.930754
O  2.382579 0.928303 0.264486
O  2.081895 -1.160618 -0.72642
C  -1.573678 -0.00486 0.191856
C  -0.455612 0.625701 1.064323
C  0.654851 -0.465091 1.190928
C  -1.162707 -1.47129 -0.075959
C  -0.119835 -1.800056 1.017691
C  -3.103803 1.358649 -1.046541
C  -3.887259 0.460116 -0.074519
C  1.751578 -0.313169 0.135835
C  3.500631 1.214668 -0.687601
C  4.826249 0.67668 -0.141471
H  -0.88026 0.844545 2.058821
H  -0.088302 1.565808 0.624855
H  1.152634 -0.386717 2.175192
H  -0.691275 -1.52301 -1.07294
H  -2.041693 -2.137373 -0.067874
H  -0.620266 -2.055899 1.970052
H  0.542778 -2.632123 0.72948
H  -3.507827 1.381875 -2.071317
H  -3.000287 2.387658 -0.649115
H  -4.708383 0.965113 0.457562
H  -4.257346 -0.454004 -0.580698
H  3.255055 0.761237 -1.663851
H  3.499974 2.313697 -0.76617
H  5.653856 0.969112 -0.814354
H  5.034917 1.087861 0.861351
H  4.805124 -0.424321 -0.08088
