program: Gaussian 09
title: 000245400
version: EM64L-G09RevD.01
frameworkgroup: C1[X(C13H25NO3)]
method: RPBEPBE
basis: SDD
operation: Freq
keyword: #p
keyword: freq=noraman
keyword: PBEPBE/SDD
title: #p freq=noraman PBEPBE/SDD
converged: YES YES NO NO
title: Mulliken charges:
elementType: O O O N C C C C C C C C C C C C C H H H H H H H H H H H H H H H H H H H H H H H H H
charge: -0.276808 -0.289575 -0.251374 -0.133710 -0.368728 -0.528329 -0.366305 0.241729 -0.522036 -0.377649 -0.347200 0.245566 -0.647737 -0.663708 0.039474 -0.685718 -0.684993 0.209063 0.224922 0.227188 0.226358 0.198596 0.218967 0.247985 0.239970 0.237720 0.220284 0.258180 0.199663 0.217905 0.223869 0.219130 0.215067 0.253203 0.202560 0.230466 0.223709 0.206904 0.231548 0.219821 0.211930 0.252093
chargesum: 0.00000
title: Mulliken charges with hydrogens summed into heavy atoms:
elementType: O O O N C C C C C C C C C C C C C
charge: -0.276808 -0.289575 -0.251374 -0.133710 0.065257 -0.074784 0.051258 0.241729 -0.034081 0.080355 0.110644 0.245566 0.013167 0.007122 0.269940 -0.023557 -0.001149
polarizability: 2.07664755e+02 -5.58256135e+00 1.50871352e+02 1.83487263e+00 -5.20065360e+00 1.23082860e+02
1716.lowfreq: -13.5853 -10.0632 -0.0010 -0.0007 -0.0003 1.7263 5.4221 19.3710 31.6959
frequency: -11.2696 19.2953 31.4130 39.9735 58.6323 62.7723 70.2237 72.7915 91.1445 113.9645 125.2110 134.7822 152.7105 165.7694 191.8351 198.6246 212.6535 230.6080 249.0392 289.8658 312.5028 333.0135 359.8828 380.8308 399.9145 424.7964 448.0923 479.8544 510.7337 563.3080 569.8587 595.0598 683.3014 724.1364 746.1615 770.8123 776.3020 787.2124 793.2876 876.8910 898.2936 904.1041 923.0709 926.4157 939.5927 942.4357 1016.3385 1047.8684 1053.2670 1068.2190 1075.5880 1080.0400 1091.3336 1097.2467 1097.7022 1116.5582 1140.5723 1148.0095 1156.3496 1184.3400 1215.5169 1225.5740 1236.5508 1255.2502 1279.6717 1290.7508 1295.5223 1305.7037 1321.3796 1335.7276 1340.0862 1349.6780 1357.5967 1365.7935 1380.8023 1382.6220 1384.9405 1397.1388 1414.4991 1440.9408 1444.4439 1456.3572 1456.4922 1465.0897 1465.5387 1466.2855 1468.5253 1472.8129 1477.4326 1481.7177 1483.5818 1488.2670 1493.0052 1582.3829 1632.4153 2959.7913 2976.4936 2982.7000 2983.3453 2984.5447 2988.6248 2992.2234 2995.7299 2999.2959 3004.7734 3013.1269 3025.9384 3028.7613 3054.3619 3061.5704 3065.9711 3070.4913 3082.5251 3082.7560 3083.6746 3091.6977 3092.2340 3097.6668 3102.3774 3103.5173
redmass: 3.8840 3.3860 2.9811 3.5465 3.5161 2.6543 2.2865 3.2950 4.2313 3.1294 3.3025 2.8870 2.1965 3.7735 1.1487 1.4707 1.1559 1.2285 1.3817 3.0351 2.7858 2.6512 4.2133 3.2454 2.5008 2.7601 3.3170 2.8629 3.0217 3.1237 2.9689 3.2499 5.3168 1.1557 2.9439 2.7006 1.1456 1.4610 1.4481 3.5530 2.0139 1.7663 3.0075 1.2651 2.1555 1.4503 2.9491 4.0714 2.9489 1.9793 1.9660 1.8304 2.2545 1.9385 1.9278 1.4621 1.8054 2.1969 2.0188 1.9011 2.8727 1.3795 1.3387 1.4392 1.1089 1.1619 1.2801 1.3712 1.4249 1.3854 1.3014 1.5386 1.2926 1.7274 1.2621 1.2163 1.2108 1.2306 2.4263 1.0884 1.1002 1.1182 1.0526 1.0762 1.0484 1.0479 1.0437 1.0502 1.0633 1.0937 1.0581 1.0482 1.1067 6.3249 9.7619 1.0610 1.0643 1.0359 1.0353 1.0624 1.0356 1.0359 1.0656 1.0609 1.0631 1.0961 1.0864 1.0975 1.0983 1.0968 1.0995 1.1017 1.0991 1.0989 1.0994 1.1015 1.0987 1.1005 1.1017 1.1005
irintensity: 2.0703 0.2062 0.5285 2.0126 0.2439 1.3841 0.1036 1.0672 3.7930 1.8098 1.2345 1.8899 2.3314 0.1554 0.9293 3.2767 1.2164 0.2645 1.8643 1.9044 0.1859 0.9432 31.2961 5.5326 2.7468 2.5945 8.1569 5.2944 2.0494 5.0549 2.1795 3.3860 2.4815 12.6939 3.8893 13.9999 3.5710 7.2428 1.0701 2.4971 4.4221 4.6491 44.0426 3.6610 10.6847 2.8978 0.3188 27.3005 14.2145 17.7195 19.0360 6.3349 43.3324 98.9034 144.1118 57.9150 79.2211 93.5397 20.5347 4.6560 29.7249 13.5592 15.8272 143.6958 0.3113 12.8010 21.9134 6.9830 2.1807 8.4470 10.3632 22.4882 10.5736 10.7077 33.2972 7.5709 34.9013 16.4432 115.1147 35.8845 9.8522 17.0559 8.7163 0.1590 5.0127 4.2945 14.4988 5.1859 6.1527 17.7919 14.9183 20.8879 10.2157 241.1967 152.2096 16.6863 1.9364 28.4689 22.8584 16.7793 16.1460 25.1898 35.8191 39.5894 39.2004 10.6124 7.0718 1.1986 0.9531 2.1469 10.8587 68.0515 28.1383 57.9029 5.0670 51.2374 52.2143 21.6128 31.9964 32.2491
temp: 298.150 k
press: 1.00000 atm
elementType: 8 8 8 7 6 6 6 6 6 6 6 6 6 6 6 6 6 1 1 1 1 1 1 1 1 1 1 1 1 1 1 1 1 1 1 1 1 1 1 1 1 1
symmnumber: 1
zpe: 955749.8 jmol-1
zpe.correction: 0.364026 hartree
zpe.thermalcorrener: 0.384836 hartree
zpe.thermalcorrenthalpy: 0.385780 hartree
zpe.thermalcorrgfe: 0.311981 hartree
zpe.sumelectzpe: -789.443809 hartree
zpe.sumelectthermal: -789.422998 hartree
zpe.sumelectthermalent: -789.422054 hartree
zpe.sumelectthermalfe: -789.495853 hartree
dipole: -0.7485 1.8569 -1.3382
dipole: 2.4082
quadrupole: -76.2927 -113.7151 -104.5592
quadrupole: -14.6381 5.4868 3.7146
quadrupole: 21.8963 -15.5261 -6.3702 -14.6381 5.4868 3.7146
hfenergy: -789.8078344 hartree
pointgroup: C01 [X(C13H25N1O3)]
dipole: -0.2829809 0.7663976 -0.4797928 debye
polarizability: 207.5225031|-6.1608588|151.5427086|2.2598444|-3.3935206|122.5537557 unknown
InChI: InChI=1S/C13H25NO3/c1-5-14(6-2)12(15)9-7-8-10-13(16)17-11(3)4/h11H,5-10H2,1-4H3
charge 0 multiplicity 1
42 atoms
O  4.462008 -0.572826 0.011212
O  -2.979909 -1.65197 0.728525
O  3.45982 1.525712 -0.204173
N  -4.239668 0.139388 -0.03972
C  -0.469492 -0.459509 0.299923
C  -1.739819 0.260755 -0.193277
C  0.816284 0.268796 -0.144006
C  -3.02232 -0.491405 0.20393
C  2.086665 -0.464964 0.332095
C  -4.382864 1.4788 -0.650389
C  -5.485994 -0.577818 0.327691
C  3.365666 0.294234 0.015862
C  -4.540541 2.611097 0.391155
C  -6.008663 -1.47547 -0.814393
C  5.82238 0.039457 -0.225742
C  6.677579 -1.091452 -0.801139
C  6.347234 0.609438 1.099673
H  -0.502106 -0.53771 1.403777
H  -0.477723 -1.499789 -0.074695
H  -1.763773 1.295731 0.202168
H  -1.703294 0.353746 -1.299421
H  0.838435 0.356701 -1.248836
H  0.831832 1.303933 0.247437
H  2.158053 -1.479595 -0.099454
H  2.049304 -0.604969 1.432446
H  -3.515256 1.684368 -1.299435
H  -5.270309 1.456979 -1.312241
H  -5.265358 -1.199554 1.211768
H  -6.245285 0.175417 0.610821
H  -4.683742 3.584439 -0.113638
H  -3.646229 2.683014 1.035241
H  -5.414306 2.431533 1.042936
H  -6.949608 -1.972537 -0.514158
H  -5.264441 -2.255158 -1.048612
H  -6.208296 -0.890746 -1.731646
H  5.683765 0.856189 -0.95883
H  6.762984 -1.922174 -0.078554
H  7.693372 -0.718636 -1.026106
H  6.235212 -1.4845 -1.732482
H  6.416689 -0.185861 1.863009
H  7.355128 1.039351 0.952423
H  5.684485 1.408863 1.471452
