program: Gaussian 09
title: 000245409
version: EM64L-G09RevD.01
frameworkgroup: C1[X(C14H22O5)]
method: RPBEPBE
basis: SDD
operation: Freq
keyword: #pfreq=noraman
keyword: PBEPBE/SDD
title: #p freq=noraman PBEPBE/SDD
converged: NO YES NO NO
title: Mulliken charges:
elementType: O O O O O C C C C C C C C C C C C C C H H H H H H H H H H H H H H H H H H H H H H
charge: -0.273831 -0.266641 -0.274048 -0.229102 -0.244407 0.264691 -0.502579 -0.462914 -0.394968 -0.422457 -0.385984 0.213582 -0.022984 -0.464772 -0.327066 -0.477169 -0.292357 0.312128 -0.765605 0.241641 0.220994 0.210001 0.250657 0.209003 0.205277 0.253145 0.197635 0.186102 0.207499 0.234520 0.255298 0.219939 0.239588 0.246907 0.238262 0.233088 0.222120 0.200289 0.245151 0.246078 0.253290
chargesum: 0.00000
title: Mulliken charges with hydrogens summed into heavy atoms:
elementType: O O O O O C C C C C C C C C C C C C C
charge: -0.273831 -0.266641 -0.274048 -0.229102 -0.244407 0.264691 -0.039944 -0.002256 0.019312 0.028323 0.007617 0.213582 0.211536 0.010465 0.159429 -0.005819 0.130051 0.312128 -0.021085
polarizability: 1.76576288e+02 5.69466668e-03 1.69114424e+02 -4.30279854e+00 -2.54205990e+00 1.38441462e+02
1716.lowfreq: -0.9883 -0.0008 -0.0004 0.0003 8.8165 16.5338 25.5225 28.0092 35.5893
frequency: 23.5675 27.0907 35.5789 52.2484 75.6052 79.0194 89.9042 106.7931 109.9140 118.1055 164.4125 190.7244 212.8035 238.6985 254.1507 275.1036 283.0869 302.4198 338.8119 351.6768 384.4028 400.4165 437.1550 456.8872 496.5185 536.6882 551.9590 576.4409 589.2745 646.5260 686.6049 706.6088 748.6295 787.1297 807.0390 819.9176 824.5300 830.5992 861.0074 866.7415 883.1356 891.5733 915.7312 917.6978 929.7251 940.1957 955.8373 992.9334 994.5768 998.0705 1013.9608 1026.3263 1040.9052 1052.5864 1082.1127 1084.7003 1101.2086 1108.8192 1129.1766 1142.6250 1153.7928 1171.6148 1176.6158 1209.4433 1218.4573 1230.1586 1233.7152 1257.0530 1263.2510 1272.5596 1296.9519 1301.0774 1311.7331 1316.2795 1328.8838 1335.5833 1337.9732 1342.7918 1344.0968 1356.7235 1369.3404 1381.9991 1452.8552 1453.1034 1454.1666 1461.2625 1461.8108 1463.2402 1467.8098 1474.7613 1475.4960 1480.2470 1491.6029 1627.6789 1641.9670 2966.4773 2978.4837 2979.7424 2992.4015 2999.6927 3001.0817 3006.7147 3011.8553 3018.2246 3030.5100 3034.6599 3041.5405 3041.6207 3064.1766 3064.7963 3071.7216 3078.3460 3085.7928 3097.7439 3098.3187 3122.8500 3142.1526
redmass: 3.4915 3.8178 4.0106 1.3696 2.9560 4.1735 3.2333 4.3652 3.9204 4.6094 3.3829 3.6053 3.7771 2.6128 2.6975 2.6873 4.0949 3.5650 3.7070 2.2058 2.5437 3.4069 3.2712 3.3253 2.4628 2.9349 2.8892 3.3295 1.9980 6.1057 5.1677 5.7192 5.6857 1.4445 2.3746 2.3338 3.6335 2.6774 2.3453 2.6986 2.3254 1.8642 2.2262 2.6235 3.6119 1.4271 3.4157 2.3982 1.9010 1.6938 2.9617 3.2238 1.6708 1.8771 1.3539 1.5027 1.6982 2.9199 1.4191 1.6903 1.5909 1.8071 2.3357 3.3311 1.3074 1.9601 1.3670 1.3507 1.2363 1.2731 1.7165 1.4052 1.2633 1.3657 1.3040 1.3675 1.3761 1.3651 1.4339 1.4462 1.4041 1.2423 1.0717 1.0827 1.0521 1.0896 1.0838 1.0921 1.0846 1.0868 1.0886 1.0934 1.0945 9.7506 9.5851 1.0639 1.0624 1.0646 1.0634 1.0632 1.0637 1.0374 1.0687 1.0617 1.0811 1.0958 1.0972 1.0627 1.0998 1.0986 1.1015 1.1009 1.1017 1.0960 1.1041 1.1086 1.1016
irintensity: 2.2085 1.3669 1.2427 1.5329 0.0273 0.9946 0.4077 2.8551 6.0287 0.8537 2.1168 0.7838 2.0090 2.6363 7.3670 3.1757 5.0619 2.2117 12.8078 10.1860 4.7721 8.3677 2.7670 11.3304 0.1646 6.5668 1.7490 7.4770 4.5237 5.9961 6.0065 15.6637 10.6673 0.7412 4.5813 7.4842 2.1515 5.2273 7.0929 21.9061 3.2917 8.8899 6.3886 21.1518 83.7073 1.5106 45.5002 43.4486 69.5941 7.7617 64.7111 84.6892 5.2102 10.4901 9.4045 13.2241 75.5401 161.0669 2.3368 4.5843 3.5318 1.0855 41.0832 269.1997 27.1279 17.6292 12.3820 4.3348 2.2268 3.4841 4.8586 9.3438 2.8191 0.2317 1.7385 4.5975 1.3001 1.2923 0.6586 2.5964 7.7104 53.7311 9.6659 29.5880 15.7902 3.6547 8.5139 6.0493 13.1626 7.5728 34.9001 12.7370 1.5595 108.9597 167.0052 38.5701 36.3065 90.6402 9.9317 39.0174 26.9876 2.8190 13.8461 19.8616 27.4383 57.9999 70.1897 12.5438 33.6844 22.1931 21.2594 28.3567 21.8446 9.5691 39.3908 8.2563 8.8472
temp: 298.150 k
press: 1.00000 atm
elementType: 8 8 8 8 8 6 6 6 6 6 6 6 6 6 6 6 6 6 6 1 1 1 1 1 1 1 1 1 1 1 1 1 1 1 1 1 1 1 1 1 1
symmnumber: 1
zpe: 903729.0 jmol-1
zpe.correction: 0.344212 hartree
zpe.thermalcorrener: 0.363886 hartree
zpe.thermalcorrenthalpy: 0.364830 hartree
zpe.thermalcorrgfe: 0.293981 hartree
zpe.sumelectzpe: -921.314368 hartree
zpe.sumelectthermal: -921.294694 hartree
zpe.sumelectthermalent: -921.293750 hartree
zpe.sumelectthermalfe: -921.364600 hartree
dipole: 0.8703 -1.8144 -2.0592
dipole: 2.8792
quadrupole: -103.6480 -108.2984 -118.8465
quadrupole: 8.5767 -5.6915 -1.0498
quadrupole: 6.6163 1.9660 -8.5822 8.5767 -5.6915 -1.0498
hfenergy: -921.6585805 hartree
pointgroup: C01 [X(C14H22O5)]
dipole: -0.4042131 0.7293164 -0.7667366 debye
polarizability: 175.1674652|0.2694011|168.066128|7.3647973|7.2098794|140.8985813 unknown
InChI: InChI=1S/C14H22O5/c1-11(15)19-14(7-3-2-4-8-14)13(16)18-10-12-6-5-9-17-12/h12H,2-10H2,1H3
charge 0 multiplicity 1
41 atoms
O  -1.782785 -1.605883 -1.129044
O  0.764895 -0.78975 -0.496183
O  4.447258 -0.212447 -0.138409
O  -0.03696 0.311232 1.400722
O  -1.124731 -2.754558 0.79216
C  -1.599497 -0.274741 -0.44222
C  -1.603907 0.734524 -1.619445
C  -2.785897 -0.035347 0.520873
C  -1.68641 2.19927 -1.130539
C  -2.915073 1.442749 0.969183
C  -2.929314 2.413269 -0.233978
C  -0.239713 -0.233189 0.292922
C  3.05834 0.176779 -0.514469
C  2.854085 1.606932 0.036827
C  2.13086 -0.889454 0.099549
C  3.7815 1.63517 1.280438
C  4.990281 0.803976 0.806086
C  -1.515423 -2.765947 -0.397744
C  -1.734689 -3.991003 -1.255959
H  -0.712279 0.561691 -2.247315
H  -2.494926 0.502274 -2.233825
H  -3.700555 -0.333601 -0.028919
H  -2.685756 -0.693614 1.400636
H  -0.772168 2.466829 -0.562937
H  -1.72213 2.869607 -2.010105
H  -2.072311 1.690725 1.638459
H  -3.845437 1.551657 1.558698
H  -3.84532 2.246209 -0.838313
H  -2.965771 3.459802 0.12421
H  2.985234 0.131297 -1.616546
H  1.802183 1.812694 0.292185
H  3.191713 2.34866 -0.709855
H  2.058607 -0.788491 1.19585
H  2.489352 -1.89438 -0.171465
H  3.282356 1.154664 2.140797
H  4.065013 2.659641 1.574893
H  5.504569 0.260922 1.617483
H  5.72511 1.431284 0.262849
H  -1.740115 -4.890909 -0.624018
H  -2.679278 -3.910348 -1.818292
H  -0.915612 -4.072293 -1.993244
