program: Gaussian 09
title: 000245402
version: EM64L-G09RevD.01
frameworkgroup: C1[X(C13H25NO3)]
method: RPBEPBE
basis: SDD
operation: Freq
keyword: #p
keyword: freq=noraman
keyword: PBEPBE/SDD
title: #p freq=noraman PBEPBE/SDD
converged: YES YES NO NO
title: Mulliken charges:
elementType: O O O N C C C C C C C C C C C C C H H H H H H H H H H H H H H H H H H H H H H H H H
charge: -0.299721 -0.263799 -0.254713 -0.147650 -0.422873 -0.420304 -0.009363 -0.000101 0.258861 -0.710253 -0.686686 -0.716712 -0.700289 -0.532247 -0.515384 0.240855 -0.505531 0.223546 0.256608 0.220863 0.233279 0.192612 0.193373 0.214048 0.202330 0.217503 0.202621 0.242550 0.205972 0.218616 0.204775 0.225722 0.218612 0.213818 0.226038 0.284647 0.230487 0.253757 0.289700 0.239284 0.241158 0.233995
chargesum: 0.00000
title: Mulliken charges with hydrogens summed into heavy atoms:
elementType: O O O N C C C C C C C C C C C C C
charge: -0.299721 -0.263799 -0.254713 -0.147650 0.057281 0.033838 0.183249 0.193271 0.258861 -0.076372 -0.035543 -0.067599 -0.041822 -0.017114 0.028073 0.240855 0.208906
polarizability: 1.92733456e+02 4.07822813e+00 1.58808800e+02 2.33270642e+00 6.61446120e+00 1.24699561e+02
1716.lowfreq: -10.7173 -0.0008 -0.0008 -0.0007 1.8553 9.8227 20.6950 26.9419 35.0490
frequency: 20.1810 26.9200 34.5940 41.1253 42.2333 73.1166 95.7048 102.0318 114.9554 130.3489 140.4579 170.8020 188.4505 209.7325 221.6265 224.4942 264.1903 269.5369 276.1832 286.7788 294.0904 318.3486 342.6971 368.9204 377.6832 399.7683 436.2316 473.2876 515.1798 532.0883 565.9044 612.3437 653.9819 666.2815 736.6076 774.2094 787.3043 812.1530 858.8903 877.4968 888.1860 917.6066 919.8618 946.2693 954.2033 956.9768 961.9183 964.7023 994.9288 1014.0529 1065.3816 1086.5937 1103.9238 1113.1671 1119.5755 1135.7742 1144.8608 1149.1501 1158.1427 1179.3937 1190.3363 1207.5617 1229.6468 1248.8898 1275.0004 1294.6790 1303.9879 1309.8349 1320.5727 1341.7337 1354.9728 1359.8467 1372.6934 1376.2471 1377.3138 1397.3697 1398.6531 1411.5300 1423.0264 1442.4546 1446.2026 1453.1464 1456.6257 1457.2081 1464.5856 1469.9527 1472.0884 1476.6886 1479.4393 1480.8442 1489.7806 1492.1142 1495.0752 1572.5296 1637.6990 2950.0042 2952.1612 2966.3275 2971.1719 2976.4061 2978.6405 2994.1912 3002.4402 3004.4419 3012.5193 3022.6177 3057.8135 3060.3995 3062.3751 3063.1574 3068.1682 3069.8905 3071.2532 3073.4740 3077.4270 3080.3602 3088.0009 3096.3045 3104.8738 3148.5263
redmass: 3.9588 4.4808 2.9989 2.8743 3.7043 3.3724 3.4938 1.0819 4.7699 2.6255 2.8879 3.1427 3.0561 3.3235 1.6048 1.7472 1.1499 1.1822 2.8549 2.3202 1.5209 2.2456 2.9663 2.0751 2.1572 2.3981 1.6679 3.2857 3.4347 2.5127 3.2086 4.0929 3.3384 3.5134 4.1708 3.3295 2.7451 2.2429 2.9039 1.6251 1.9987 1.2821 1.2184 2.0064 1.9980 3.1295 1.5776 1.8460 2.4941 2.1895 1.7432 3.1061 1.6255 1.2684 1.8435 2.0599 2.0838 1.4431 1.5818 2.1784 1.9803 2.4487 1.4817 1.2831 1.3313 1.3941 1.4657 1.4810 1.5912 1.4633 1.6758 1.2684 1.2417 1.2341 1.2232 1.2228 1.2226 2.0638 1.1975 1.0829 1.1151 1.0504 1.0993 1.0714 1.0505 1.0457 1.0596 1.0661 1.0667 1.0618 1.0583 1.0551 1.0621 5.8276 8.7253 1.0822 1.0823 1.0358 1.0358 1.0360 1.0365 1.0648 1.0528 1.0404 1.0608 1.0600 1.0944 1.0994 1.0997 1.0998 1.0998 1.0997 1.0997 1.0997 1.0995 1.0954 1.1030 1.0994 1.1045 1.1047
irintensity: 0.4893 1.2459 0.1330 0.4949 1.2020 1.5792 1.4410 0.1733 3.4783 0.2060 4.8235 7.9716 2.5743 1.2081 2.0379 1.9266 1.4926 0.5025 20.2046 10.3614 1.6052 2.7612 8.1456 0.0640 1.7735 3.3006 4.0277 3.1919 8.2266 4.6198 24.7063 3.6642 4.5595 6.8906 0.4790 6.5743 1.8012 18.6826 19.2895 3.7944 12.1208 1.2489 0.2062 10.9858 6.4507 26.7702 0.8239 0.9613 11.8171 9.7019 38.0457 2.1992 1.2580 0.6785 2.8594 225.4836 122.6401 3.2625 33.8497 5.4768 2.4735 11.6551 2.8774 168.6230 0.4577 40.3357 2.2634 7.1077 45.2714 6.1486 24.8293 4.6309 5.9231 24.8661 10.5956 13.7868 16.7390 86.4512 29.2616 9.0162 42.8524 14.0931 26.9459 2.4946 13.6184 1.1024 3.8429 4.4997 35.0573 3.2540 14.1365 30.3963 18.9150 231.3889 139.1119 28.6084 28.9654 27.9570 35.0787 14.5355 27.6123 8.2662 70.7949 4.6184 42.1896 28.9134 6.1365 45.1664 0.1047 9.7971 124.9840 37.9479 13.1989 73.4562 55.8734 5.2759 7.1333 22.5622 28.4872 17.4876
temp: 298.150 k
press: 1.00000 atm
elementType: 8 8 8 7 6 6 6 6 6 6 6 6 6 6 6 6 6 1 1 1 1 1 1 1 1 1 1 1 1 1 1 1 1 1 1 1 1 1 1 1 1 1
symmnumber: 1
zpe: 957280.9 jmol-1
zpe.correction: 0.364609 hartree
zpe.thermalcorrener: 0.385827 hartree
zpe.thermalcorrenthalpy: 0.386771 hartree
zpe.thermalcorrgfe: 0.312326 hartree
zpe.sumelectzpe: -789.427718 hartree
zpe.sumelectthermal: -789.406501 hartree
zpe.sumelectthermalent: -789.405557 hartree
zpe.sumelectthermalfe: -789.480001 hartree
dipole: 1.2668 1.1621 2.3072
dipole: 2.8772
quadrupole: -87.6322 -109.2429 -108.1587
quadrupole: 4.9257 -0.2378 -3.7172
quadrupole: 14.0457 -7.5649 -6.4808 4.9257 -0.2378 -3.7172
hfenergy: -789.7923275 hartree
pointgroup: C01 [X(C13H25N1O3)]
dipole: 0.4992658 -0.3119775 -0.9668318 debye
polarizability: 192.7823094|0.3035353|156.7874966|-6.1500688|9.4626223|126.6720115 unknown
InChI: InChI=1S/C13H25NO3/c1-10(2)8-14(9-11(3)4)12(15)6-7-13(16)17-5/h10-11H,6-9H2,1-5H3
charge 0 multiplicity 1
42 atoms
O  0.047356 1.099223 1.626533
O  -4.74138 0.440683 0.200111
O  -3.568851 -1.493912 -0.34586
N  1.43689 0.133669 0.02581
C  2.618949 0.7511 0.692166
C  1.663479 -0.819165 -1.089561
C  3.069895 2.130089 0.121572
C  1.972221 -2.306088 -0.709374
C  0.177449 0.430996 0.547618
C  3.594816 2.047221 -1.33248
C  1.982042 3.221366 0.246255
C  3.316884 -2.494676 0.034819
C  0.827543 -2.993001 0.069778
C  -1.061308 -0.034423 -0.239295
C  -2.351494 0.546527 0.36422
C  -3.565791 -0.294361 0.022125
C  -6.004434 -0.299707 -0.037706
H  3.46351 0.046123 0.618243
H  2.359487 0.877681 1.758152
H  0.776875 -0.812055 -1.74772
H  2.509944 -0.440888 -1.691175
H  3.924173 2.425981 0.769767
H  2.067604 -2.817054 -1.693059
H  2.7743 1.813181 -2.036656
H  4.381935 1.276682 -1.44421
H  4.026081 3.017193 -1.642454
H  2.38685 4.205396 -0.05682
H  1.598522 3.293213 1.277784
H  1.121402 2.994332 -0.410308
H  3.567479 -3.569899 0.097136
H  4.150539 -1.984553 -0.484363
H  3.261531 -2.109966 1.069395
H  -0.10973 -3.029346 -0.514762
H  1.104701 -4.03417 0.317694
H  0.624462 -2.467535 1.021536
H  -1.135281 -1.136079 -0.23368
H  -0.96912 0.263461 -1.301366
H  -2.527764 1.590173 0.054023
H  -2.241408 0.587185 1.466103
H  -6.048054 -0.657879 -1.080104
H  -6.07539 -1.164371 0.643522
H  -6.799614 0.431255 0.164691
