program: Gaussian 09
title: 000245413
version: EM64L-G09RevD.01
frameworkgroup: C1[X(C14H27NO3)]
method: RPBEPBE
basis: SDD
operation: Freq
keyword: #p
keyword: freq=noraman
keyword: PBEPBE/SDD
title: #p freq=noraman PBEPBE/SDD
converged: YES YES NO NO
title: Mulliken charges:
elementType: O O O N C C C C C C C C C C C C C C H H H H H H H H H H H H H H H H H H H H H H H H H H H
charge: -0.300816 -0.266082 -0.246804 -0.171055 -0.104841 0.011727 -0.556425 0.263579 -0.370457 -0.363435 -0.669707 -0.671860 -0.708052 -0.706787 -0.514077 0.240870 -0.262742 -0.664883 0.244322 0.185370 0.225848 0.225607 0.212846 0.220815 0.216237 0.200600 0.214484 0.226891 0.215950 0.213337 0.227557 0.216556 0.271407 0.212755 0.204501 0.271300 0.212623 0.204070 0.242989 0.249415 0.232314 0.222340 0.248471 0.227199 0.216042
chargesum: 0.00000
title: Mulliken charges with hydrogens summed into heavy atoms:
elementType: O O O N C C C C C C C C C C C C C C
charge: -0.300816 -0.266082 -0.246804 -0.171055 0.139481 0.197096 -0.104970 0.263579 0.063205 0.053402 -0.012381 -0.014410 -0.019390 -0.018794 -0.021673 0.240870 0.191912 0.026830
polarizability: 2.13322590e+02 -4.18338978e+00 1.63556580e+02 -7.21560956e-01 1.04466227e+00 1.35156044e+02
1716.lowfreq: -11.4811 -6.0595 -3.5078 -0.0008 0.0004 0.0010 4.0114 16.5130 32.5795
frequency: 1.7537 16.0515 32.3687 38.2117 64.4210 67.0147 69.9730 77.9438 99.2504 114.1124 131.2395 153.9173 158.4747 161.7774 201.6228 205.6138 214.0122 224.5095 233.4595 239.2356 245.4772 294.7642 312.3017 331.5672 337.8188 364.7718 382.1921 438.7247 466.6690 481.6513 482.5884 518.3329 561.1461 581.3997 592.1720 659.0296 724.8621 727.6947 785.9100 795.9673 817.3391 849.2618 877.0144 893.0408 904.2754 915.2555 920.0391 929.7856 937.9105 942.3363 1010.6210 1030.8232 1049.0714 1053.7017 1074.4946 1092.0443 1095.1653 1114.3021 1129.5945 1132.3765 1141.2720 1148.8336 1153.9125 1156.0671 1169.1325 1207.1535 1225.9937 1236.6405 1276.8661 1279.0705 1285.3494 1290.3156 1311.3626 1312.6228 1320.8130 1339.6355 1354.6723 1365.6727 1365.8518 1369.3520 1380.1263 1380.8857 1390.3513 1396.1843 1418.2396 1441.4146 1451.5601 1453.7355 1456.4013 1463.6824 1464.3611 1465.0519 1468.2573 1469.1232 1478.2914 1481.4063 1484.4577 1486.0240 1486.7732 1502.0832 1572.4518 1640.3479 2958.0108 2979.2669 2980.1151 2983.6797 2985.1225 2986.6266 2987.0932 2991.7513 3001.8271 3008.2100 3008.5946 3027.6010 3028.1418 3052.6368 3057.2650 3070.7922 3072.0723 3074.9746 3077.8388 3084.7858 3086.8245 3087.2133 3091.2707 3094.3828 3110.4817 3115.5291 3117.3948
redmass: 4.3820 3.5321 3.7123 3.4664 3.3567 2.9794 1.8824 3.0265 3.5151 3.2652 3.4321 3.8300 2.4986 2.0906 1.6501 1.0810 1.2110 1.4940 1.5416 1.2704 1.4817 2.8439 2.6108 2.8318 3.2767 4.0504 2.8881 2.9332 3.3621 3.1934 3.3254 3.1424 2.9240 3.1579 2.7257 4.0636 1.4480 2.2227 1.9661 1.3989 1.7767 2.5466 2.7771 3.4870 1.5031 1.2574 1.2020 2.6051 1.3239 1.4798 2.8507 1.9188 3.7300 3.3276 1.8196 2.5494 2.2081 1.7151 2.4326 1.8574 1.8666 2.4333 2.2362 1.6800 1.9986 2.9487 1.3918 1.3258 1.3729 1.1310 1.2106 1.2151 1.6042 1.5507 1.2863 1.5126 1.3622 1.2770 1.4664 1.3183 1.2060 1.2245 1.2332 1.2334 1.7621 1.0870 1.0998 1.0458 1.0920 1.0429 1.0788 1.0467 1.0693 1.0517 1.0476 1.0948 1.0514 1.0518 1.0572 1.0651 6.1211 8.9434 1.0594 1.0632 1.0354 1.0362 1.0357 1.0381 1.0620 1.0361 1.0610 1.0980 1.0817 1.0639 1.0932 1.0987 1.0877 1.1027 1.0999 1.0994 1.0990 1.1006 1.0973 1.0985 1.1032 1.0965 1.0996 1.0991 1.1059
irintensity: 1.9376 0.1184 0.8768 1.0516 0.9033 0.9849 0.1343 0.0133 5.3383 0.3730 0.7909 0.4401 1.2604 0.9267 5.3667 0.0454 0.4568 0.2261 0.5408 0.1491 0.5136 4.5858 2.8066 0.1678 8.3435 31.2124 4.1220 3.1752 1.1215 1.6252 5.2481 5.4509 3.3011 8.3031 9.4689 7.0792 8.9199 5.5900 6.5544 0.6719 2.4602 3.2439 1.7874 10.3485 7.0015 2.2776 3.2726 9.4326 0.0230 0.0071 35.8663 54.1030 14.5237 35.2945 10.7777 2.5085 53.8577 133.3013 25.1956 38.5125 149.1225 18.2920 7.2594 8.9226 21.3634 39.2590 23.7173 2.5557 102.9792 20.0159 69.0577 19.8482 29.7912 29.2347 1.6961 33.7272 2.5774 26.0415 33.8011 4.8875 31.4369 47.0286 22.7193 5.8936 60.2719 27.3345 16.8174 0.8017 11.5269 14.5804 1.6208 2.2172 23.7457 2.2300 13.3777 22.3745 13.1480 1.7841 4.5801 16.8069 201.8860 144.0785 22.1820 3.1982 17.1867 38.7741 20.8555 31.3817 17.8771 20.3335 31.4144 9.9321 34.2809 27.2077 6.5692 0.7361 1.7840 55.2641 27.1268 3.2502 72.9966 23.3456 36.8390 58.6224 0.5191 58.9456 1.2161 21.7994 35.1055
temp: 298.150 k
press: 1.00000 atm
elementType: 8 8 8 7 6 6 6 6 6 6 6 6 6 6 6 6 6 6 1 1 1 1 1 1 1 1 1 1 1 1 1 1 1 1 1 1 1 1 1 1 1 1 1 1 1
symmnumber: 1
zpe: 1028906.6 jmol-1
zpe.correction: 0.391890 hartree
zpe.thermalcorrener: 0.414873 hartree
zpe.thermalcorrenthalpy: 0.415817 hartree
zpe.thermalcorrgfe: 0.334480 hartree
zpe.sumelectzpe: -828.660589 hartree
zpe.sumelectthermal: -828.637605 hartree
zpe.sumelectthermalent: -828.636661 hartree
zpe.sumelectthermalfe: -828.717999 hartree
dipole: -0.8752 2.3194 -0.1923
dipole: 2.4865
quadrupole: -87.3182 -120.3531 -110.2276
quadrupole: -13.4780 -0.9248 -1.4436
quadrupole: 18.6481 -14.3868 -4.2613 -13.4780 -0.9248 -1.4436
hfenergy: -829.0524784 hartree
pointgroup: C01 [X(C14H27N1O3)]
dipole: -0.3324448 0.9145621 0.1001603 debye
polarizability: 213.2068166|-4.6121026|162.2457563|-1.5689437|6.3066572|136.5826412 unknown
InChI: InChI=1S/C14H27NO3/c1-6-18-14(17)10-8-7-9-13(16)15(11(2)3)12(4)5/h11-12H,6-10H2,1-5H3
charge 0 multiplicity 1
45 atoms
O  -1.991848 -1.807097 -0.396658
O  5.438432 -0.624118 -0.66586
O  4.485668 1.257311 0.335297
N  -3.261986 0.110197 -0.024605
C  -3.371772 1.582777 0.207033
C  -4.542424 -0.678389 -0.051745
C  -0.746966 0.281816 -0.128457
C  -2.046662 -0.548651 -0.194418
C  0.508067 -0.603819 -0.263225
C  1.806658 0.228179 -0.209121
C  -3.940161 1.899966 1.612819
C  -4.179752 2.283704 -0.913534
C  -4.612595 -1.711507 1.097926
C  -4.7968 -1.323795 -1.434841
C  3.061956 -0.658017 -0.336126
C  4.358189 0.118409 -0.172146
C  6.795566 -0.013678 -0.511598
C  7.384254 -0.340964 0.863811
H  -2.348751 1.988715 0.168936
H  -5.342275 0.066265 0.121795
H  -0.746635 1.044959 -0.934273
H  -0.700295 0.840087 0.829012
H  0.504165 -1.360817 0.543793
H  0.449639 -1.174309 -1.208766
H  1.862262 0.796904 0.738916
H  1.80872 0.982646 -1.020915
H  -4.978104 1.537271 1.726194
H  -3.324455 1.429567 2.399881
H  -3.946909 2.99232 1.781812
H  -5.234423 1.954252 -0.929042
H  -3.739057 2.075554 -1.90448
H  -4.174462 3.377287 -0.752731
H  -3.838936 -2.483925 0.966213
H  -4.463821 -1.222488 2.077709
H  -5.605745 -2.198218 1.101304
H  -4.0220 -2.075385 -1.65271
H  -4.788224 -0.561428 -2.234792
H  -5.785802 -1.818899 -1.439667
H  3.048302 -1.448256 0.442607
H  3.088362 -1.191752 -1.30381
H  6.709146 1.077061 -0.661255
H  7.378148 -0.466651 -1.329761
H  6.790835 0.130418 1.665175
H  7.410484 -1.431639 1.031048
H  8.419003 0.044042 0.929651
