program: Gaussian 09
title: 000245386
version: EM64L-G09RevD.01
frameworkgroup: C1[X(C12H23NO3)]
method: RPBEPBE
basis: SDD
operation: Freq
keyword: #p
keyword: freq=noraman
keyword: PBEPBE/SDD
title: #p freq=noraman PBEPBE/SDD
converged: YES YES NO NO
title: Mulliken charges:
elementType: O O O N C C C C C C C C C C C C H H H H H H H H H H H H H H H H H H H H H H H
charge: -0.297416 -0.265418 -0.241963 -0.160707 0.020786 -0.087895 0.224672 -0.540525 -0.707709 -0.707686 -0.675478 -0.672509 -0.372707 -0.488631 0.239076 -0.504454 0.184066 0.226600 0.205826 0.243827 0.212150 0.271841 0.204538 0.271075 0.203940 0.215297 0.216740 0.214106 0.226364 0.233784 0.217260 0.211392 0.231381 0.239844 0.235042 0.255445 0.240027 0.243332 0.234688
chargesum: 0.00000
title: Mulliken charges with hydrogens summed into heavy atoms:
elementType: O O O N C C C C C C C C C C C C
charge: -0.297416 -0.265418 -0.241963 -0.160707 0.204851 0.138705 0.224672 -0.090873 -0.019180 -0.017373 -0.018268 -0.010072 0.098518 0.001856 0.239076 0.213593
polarizability: 1.77072433e+02 1.39771191e+00 1.40565844e+02 2.55642881e+00 2.93257896e+00 1.24629007e+02
1716.lowfreq: -12.8010 -6.9671 -0.0010 -0.0007 -0.0002 4.2828 16.9771 25.9952 31.2705
frequency: 16.8249 25.9344 31.1898 61.5826 70.8833 75.0984 89.0603 104.3859 125.7490 157.3135 162.0994 188.2534 207.4231 216.4614 221.9595 225.2992 239.2829 245.0613 257.9018 300.3789 310.7060 333.2430 350.6651 416.6674 446.2951 465.2672 498.8089 516.4871 566.8195 588.6525 637.2109 677.8717 719.7018 748.1350 826.2063 850.5095 861.1171 880.0971 908.3026 922.4201 937.1555 938.0329 943.6593 959.5840 1030.1148 1033.5438 1048.1051 1068.6791 1109.3066 1112.1515 1128.4530 1141.5393 1148.0333 1148.9345 1153.5160 1166.4180 1173.8371 1206.7920 1246.3030 1248.1803 1287.7042 1308.3205 1313.4602 1316.8658 1323.7824 1357.3869 1360.8673 1368.3137 1378.5333 1383.4846 1395.9853 1419.3033 1421.9898 1444.2928 1452.3490 1453.1940 1463.5172 1463.9351 1466.4060 1468.9807 1472.3110 1478.0004 1485.4186 1486.3858 1487.8123 1501.7173 1570.9793 1643.9533 2978.1778 2981.9404 2984.3502 2986.0836 2987.2014 2987.6936 3004.4713 3006.1592 3010.3858 3047.3276 3057.0022 3063.1672 3072.7175 3076.6739 3078.3301 3080.7006 3085.5585 3088.0409 3095.4525 3106.1654 3112.6016 3117.5713 3149.4691
redmass: 5.6669 3.8648 3.9352 2.6746 2.8060 3.0893 1.0877 4.0669 2.1679 2.4726 4.2580 3.4755 1.0671 1.3901 1.6117 2.8923 1.0865 1.3310 3.2412 4.8913 2.6682 2.9168 2.5113 3.5220 2.6711 3.2482 2.7591 4.1100 3.1997 2.9537 3.8282 3.8063 3.8218 1.2754 4.0931 2.1068 2.0625 2.5015 1.2335 1.2014 2.3781 1.5890 1.4398 4.0081 2.2990 3.1603 1.7891 2.7824 1.6686 1.2740 2.3802 2.1147 1.4488 2.4564 2.3551 2.0756 1.9358 2.7341 1.3414 1.3624 1.1337 1.3422 1.4139 1.6058 1.6424 1.4932 1.2961 1.2097 1.2072 1.2300 1.2435 1.8389 1.2118 1.0829 1.0503 1.0436 1.0477 1.0500 1.0739 1.0526 1.0760 1.0492 1.0594 1.0525 1.0900 1.0669 5.6903 9.0616 1.0659 1.0352 1.0364 1.0386 1.0391 1.0605 1.0300 1.0595 1.0819 1.0960 1.0873 1.0957 1.0997 1.0993 1.0990 1.1012 1.1006 1.0987 1.0966 1.1046 1.0994 1.0988 1.1048
irintensity: 2.1281 1.4993 0.6504 0.1018 0.7995 0.0513 0.1839 1.0177 0.2661 0.6782 4.7452 7.4410 0.0449 0.2234 0.2726 2.8305 0.1092 0.7976 9.7162 17.0822 5.0687 1.9409 1.5338 1.1760 2.3342 3.4792 5.6914 12.1108 8.3473 11.6900 1.0858 10.7524 2.6292 12.6940 4.6734 3.1551 1.8143 1.7754 3.3661 3.9070 2.7307 0.6594 0.0597 21.6493 2.7208 63.3390 15.6089 3.8463 79.7154 1.6230 15.3029 24.0337 4.5750 32.1686 178.5619 27.0876 24.2792 33.7153 78.7433 24.6396 15.1450 4.4659 25.0938 127.8386 7.7851 26.0375 11.4549 25.1310 32.3454 45.6615 4.7540 55.5076 19.9058 15.7753 14.4861 0.2328 3.6888 11.6840 40.3457 3.3194 2.3721 12.4032 6.7059 4.8780 27.5960 21.1874 208.1518 157.1348 9.4835 15.7541 42.1050 16.5765 34.5602 12.7047 32.3286 25.0068 30.8803 1.1747 1.1388 0.3998 15.6075 2.3512 73.1399 43.5801 25.6594 53.6902 63.8032 27.6503 1.1660 20.1991 16.8259
temp: 298.150 k
press: 1.00000 atm
elementType: 8 8 8 7 6 6 6 6 6 6 6 6 6 6 6 6 1 1 1 1 1 1 1 1 1 1 1 1 1 1 1 1 1 1 1 1 1 1 1
symmnumber: 1
zpe: 882976.6 jmol-1
zpe.correction: 0.336308 hartree
zpe.thermalcorrener: 0.356519 hartree
zpe.thermalcorrenthalpy: 0.357463 hartree
zpe.thermalcorrgfe: 0.285459 hartree
zpe.sumelectzpe: -750.206790 hartree
zpe.sumelectthermal: -750.186579 hartree
zpe.sumelectthermalent: -750.185635 hartree
zpe.sumelectthermalfe: -750.257638 hartree
dipole: -1.1636 3.2530 -1.3116
dipole: 3.6955
quadrupole: -82.0022 -107.4533 -98.6447
quadrupole: 9.5422 1.6845 -3.1116
quadrupole: 14.0312 -11.4199 -2.6113 9.5422 1.6845 -3.1116
hfenergy: -750.5430979 hartree
pointgroup: C01 [X(C12H23N1O3)]
dipole: 0.2535647 -1.3783405 0.3869683 debye
polarizability: 176.6537763|-4.6576724|132.7460192|1.3582142|-8.6908346|132.8674889 unknown
InChI: InChI=1S/C12H23NO3/c1-9(2)13(10(3)4)11(14)7-6-8-12(15)16-5/h9-10H,6-8H2,1-5H3
charge 0 multiplicity 1
39 atoms
O  -1.388771 1.817871 -1.673144
O  4.805917 -0.478473 0.027873
O  3.163449 -0.673856 1.666751
N  -2.171184 0.040613 -0.380588
C  -3.457561 0.764862 -0.089661
C  -1.999475 -1.312174 0.233006
C  -1.214048 0.650353 -1.186063
C  0.109263 -0.079901 -1.476525
C  -4.284283 1.014091 -1.373518
C  -3.223524 2.063269 0.718645
C  -3.04433 -2.32224 -0.303259
C  -2.001937 -1.247787 1.780675
C  1.13677 0.077689 -0.325541
C  2.522654 -0.475475 -0.720119
C  3.477796 -0.546819 0.460898
C  5.835164 -0.592058 1.091153
H  -4.038005 0.074388 0.55076
H  -1.005906 -1.676286 -0.07258
H  -0.035803 -1.151414 -1.715345
H  0.504978 0.406263 -2.385699
H  -4.469475 0.067692 -1.913266
H  -3.751383 1.70655 -2.043673
H  -5.261581 1.457555 -1.10628
H  -2.660573 2.79283 0.115941
H  -4.196949 2.507244 0.9990
H  -2.65853 1.855483 1.645229
H  -2.835813 -3.330203 0.099739
H  -4.071575 -2.048934 -0.00106
H  -3.011618 -2.373552 -1.406037
H  -1.234038 -0.543548 2.14621
H  -1.782314 -2.24708 2.198816
H  -2.982262 -0.927853 2.177768
H  0.793783 -0.439115 0.589304
H  1.225138 1.149599 -0.067643
H  2.418394 -1.507168 -1.116716
H  2.987818 0.120283 -1.524817
H  5.737149 -1.556599 1.617307
H  5.723616 0.228911 1.8191
H  6.794846 -0.524512 0.560265
