program: Gaussian 09
title: 000245131
version: EM64L-G09RevD.01
frameworkgroup: C1[X(C13H18O)]
method: RPBEPBE
basis: SDD
operation: Freq
keyword: #pfreq=noraman
keyword: PBEPBE/SDD
title: #p freq=noraman PBEPBE/SDD
converged: NO YES NO NO
title: Mulliken charges:
elementType: O C C C C C C C C C C C C C H H H H H H H H H H H H H H H H H H
charge: -0.207845 0.079534 -0.143929 0.049905 0.349940 0.317273 0.484493 -0.600415 -0.598287 -0.714007 -0.708079 -0.827725 -0.839303 -0.814760 0.232141 0.238764 0.237123 0.232540 0.225320 0.223533 0.212031 0.247183 0.212610 0.267573 0.232179 0.219803 0.237690 0.233434 0.233165 0.224410 0.237126 0.226579
chargesum: 0.00000
title: Mulliken charges with hydrogens summed into heavy atoms:
elementType: O C C C C C C C C C C C C C
charge: -0.207845 0.079534 0.088211 0.049905 0.349940 0.317273 0.484493 -0.361651 -0.361164 -0.032613 -0.036254 -0.108170 -0.135015 -0.126644
polarizability: 1.88174224e+02 -1.52583475e+00 1.48091382e+02 6.80476944e+00 -1.47612014e+00 9.66160991e+01
1716.lowfreq: -0.0006 0.0007 0.0008 6.0685 10.0133 13.0950 26.7086 30.2394 61.7895
frequency: 26.6608 30.0701 61.7704 63.2938 122.4040 154.8730 163.5267 173.5112 188.9206 198.9926 217.5835 229.6413 245.5145 269.5410 275.2329 296.6180 323.8673 373.4915 427.2450 490.7678 521.1180 525.4338 552.4102 572.9042 591.6653 694.3696 718.1865 775.4201 856.1680 866.7272 896.9910 922.0820 933.2254 945.1841 960.2907 969.1650 1016.2093 1019.9115 1037.2907 1041.2548 1044.9210 1050.0719 1086.9156 1104.3985 1150.5237 1175.5767 1221.7972 1253.2691 1292.8692 1309.8149 1334.7463 1359.2989 1371.2763 1389.8778 1396.1718 1400.0152 1402.4482 1412.5922 1438.7984 1461.1364 1463.0165 1470.2389 1470.9289 1473.5456 1475.0436 1478.5773 1485.0877 1489.2079 1489.6131 1571.0535 1594.2671 1616.9522 2975.0872 2975.7451 2977.1853 2982.7587 2988.1080 3032.5667 3056.1940 3057.9048 3070.9302 3072.8535 3076.8773 3083.9938 3084.9099 3087.3483 3090.2738 3095.4468 3111.2909 3116.1001
redmass: 1.0371 2.8735 3.4619 3.7261 1.0737 2.8789 1.3300 2.0899 2.0420 1.3002 2.7041 1.1925 3.2675 2.6904 2.7623 3.6848 2.8293 3.1856 3.2829 3.0733 3.1663 4.6907 4.1983 3.8338 3.5859 3.0689 3.6115 4.7257 2.8474 1.3731 1.3125 1.1802 2.5008 2.7041 1.4182 3.8656 1.6421 1.6828 1.5764 1.6152 1.5353 1.6280 1.6908 2.4625 2.3827 1.7792 2.0508 1.4567 1.3301 5.2286 1.7039 7.2068 1.2052 1.2112 1.2364 1.2901 1.2565 2.2887 2.0598 1.0555 1.0491 1.0643 1.0610 1.0614 1.0985 1.1301 1.0689 1.0584 1.3506 6.8910 7.9309 5.9512 1.0386 1.0397 1.0341 1.0357 1.0369 1.0841 1.0953 1.0939 1.0967 1.0999 1.0991 1.1011 1.0997 1.0995 1.1002 1.0993 1.0910 1.0918
irintensity: 0.6873 0.3623 2.1612 1.5680 0.5510 0.3582 1.9825 2.6457 4.4415 0.6696 0.1016 0.8051 0.3971 0.4962 0.9948 7.8222 0.3502 0.1860 3.3306 0.4506 2.5973 0.3318 0.7107 0.3693 5.7330 4.7475 4.7725 1.1421 6.2177 19.4204 0.2433 3.8076 5.2418 19.5490 1.0672 55.8721 2.1007 3.8845 1.5970 1.9977 0.1860 37.6814 13.7732 1.3769 25.0111 3.5540 47.0480 3.8643 6.9973 4.8337 17.4630 0.0778 15.7904 30.0516 14.4628 20.1164 8.7662 4.5175 32.5593 8.0105 10.2163 5.7371 6.6284 10.7128 10.4303 34.3533 15.7557 35.0895 5.0551 33.1725 119.0092 50.6601 45.9772 16.0028 30.1605 31.8082 24.1021 10.4449 19.5018 23.0333 21.9718 20.6833 54.2451 12.0250 15.7855 16.1415 15.3811 31.5043 27.8643 17.0990
temp: 298.150 k
press: 1.00000 atm
elementType: 8 6 6 6 6 6 6 6 6 6 6 6 6 6 1 1 1 1 1 1 1 1 1 1 1 1 1 1 1 1 1 1
symmnumber: 1
zpe: 714285.2 jmol-1
zpe.correction: 0.272057 hartree
zpe.thermalcorrener: 0.288206 hartree
zpe.thermalcorrenthalpy: 0.289150 hartree
zpe.thermalcorrgfe: 0.227914 hartree
zpe.sumelectzpe: -580.354270 hartree
zpe.sumelectthermal: -580.338121 hartree
zpe.sumelectthermalent: -580.337177 hartree
zpe.sumelectthermalfe: -580.398413 hartree
dipole: 1.4996 -1.4713 2.2321
dipole: 3.0652
quadrupole: -79.3435 -79.6726 -90.9594
quadrupole: 2.9163 -4.4897 2.5959
quadrupole: 3.9816 3.6526 -7.6342 2.9163 -4.4897 2.5959
hfenergy: -580.6263272 hartree
pointgroup: C01 [X(C13H18O1)]
dipole: -0.6091838 -0.3200077 -0.9903662 debye
polarizability: 188.1996916|-1.7396702|144.2638578|6.8517539|13.45277|100.4181556 unknown
InChI: InChI=1S/C13H18O/c1-8(2)13(14)12-10(4)6-9(3)7-11(12)5/h6-8H,1-5H3
charge 0 multiplicity 1
32 atoms
O  1.999146 0.568732 1.559516
C  0.036171 0.087322 0.227725
C  2.478296 -0.25693 -0.680033
C  1.526866 0.125406 0.472907
C  -0.732105 1.280437 0.427152
C  -0.61163 -1.123301 -0.164576
C  -2.784078 0.059889 -0.229998
C  -2.121953 1.245881 0.172832
C  -2.011335 -1.114361 -0.379593
C  2.851421 1.067968 -1.411056
C  3.73953 -0.984584 -0.165938
C  -0.095341 2.58091 0.89135
C  0.134582 -2.444065 -0.311714
C  -4.285526 0.044691 -0.455787
H  1.935908 -0.893352 -1.401514
H  -2.705293 2.166564 0.301151
H  -2.508462 -2.051007 -0.6634
H  3.395851 1.742368 -0.725903
H  1.954484 1.594866 -1.785718
H  3.503595 0.84799 -2.275633
H  4.460491 -1.14039 -0.988919
H  4.225623 -0.385762 0.623605
H  3.491758 -1.972426 0.264626
H  0.263247 2.493658 1.931572
H  0.785502 2.855002 0.28207
H  -0.820901 3.410316 0.836288
H  1.000247 -2.51668 0.368566
H  -0.537565 -3.290303 -0.086464
H  0.507896 -2.593391 -1.343579
H  -4.592123 -0.805315 -1.089798
H  -4.830522 -0.044686 0.504174
H  -4.630782 0.97585 -0.939711
