program: Gaussian 09
title: 000244161
version: EM64L-G09RevD.01
frameworkgroup: C1[X(C11H12N2O7)]
method: RPBEPBE
basis: SDD
operation: Freq
keyword: #p
keyword: freq=noraman
keyword: PBEPBE/SDD
title: #p freq=noraman PBEPBE/SDD
converged: YES YES NO NO
title: Mulliken charges:
elementType: O O O O O O O N N C C C C C C C C C C C H H H H H H H H H H H H
charge: -0.285459 -0.273056 -0.232006 -0.187502 -0.180926 -0.182663 -0.183876 0.021019 0.022957 0.298081 -0.300082 -0.221419 -0.486602 -0.468099 0.438511 0.434169 -0.488243 0.216940 -0.205610 -0.674904 0.224848 0.261911 0.195395 0.204603 0.331194 0.328839 0.340491 0.193155 0.190605 0.205784 0.232464 0.229480
chargesum: 0.00000
title: Mulliken charges with hydrogens summed into heavy atoms:
elementType: O O O O O O O N N C C C C C C C C C C C
charge: -0.285459 -0.273056 -0.232006 -0.187502 -0.180926 -0.182663 -0.183876 0.021019 0.022957 0.298081 0.186678 0.178579 -0.155407 -0.139260 0.438511 0.434169 -0.147752 0.216940 0.178150 -0.007176
polarizability: 2.08547053e+02 -4.26679724e+00 1.86811301e+02 3.06595718e+01 4.10357037e-01 1.07028320e+02
1716.lowfreq: -4.6028 -3.9866 -0.0007 0.0003 0.0004 4.2545 8.1554 17.8013 41.7836
frequency: 6.9911 17.7451 41.7728 50.8227 52.2018 53.0377 74.0692 94.0010 114.5207 141.7445 154.5732 169.0626 195.6568 200.0521 235.3579 238.5682 293.3148 314.7860 321.0399 343.8886 355.8818 410.4530 462.2701 466.4951 476.9705 502.2328 509.5592 585.3579 635.1969 683.6025 686.6338 698.2455 724.9639 738.9397 747.4704 790.6104 807.8036 817.5003 867.6828 899.6365 925.1309 973.9523 980.0494 987.6990 992.7066 1001.0507 1036.4432 1067.8952 1082.4124 1088.1570 1099.4902 1114.5677 1129.8278 1141.9846 1206.6284 1207.6635 1210.2544 1233.0271 1252.2186 1253.9747 1260.1044 1337.8185 1357.3251 1379.9913 1383.4278 1391.4339 1406.0952 1406.6173 1435.4372 1453.3552 1459.9355 1460.2698 1462.4126 1479.2968 1493.0122 1589.2279 1617.3543 1638.1580 2916.2596 2925.7986 2970.3862 2973.2422 2996.8177 3034.5865 3094.8551 3104.1636 3109.5069 3179.6907 3192.7136 3200.6516
redmass: 5.5309 4.7907 9.0551 15.5851 3.0866 3.4880 4.2474 6.3122 6.9652 12.7162 4.4158 3.3144 4.6187 4.6398 2.6866 1.5071 4.6235 5.5928 4.4342 8.4359 10.1656 2.8536 4.6111 5.5809 6.1151 7.0435 3.9167 4.7126 6.4521 12.1853 8.9361 2.8462 9.1568 6.5484 8.0679 2.9794 2.9214 1.1887 11.2119 5.0826 2.2298 1.4401 1.5995 6.2568 1.4033 2.5096 2.6638 1.4870 3.1249 1.9946 2.0132 3.8423 2.0907 1.6493 6.8374 3.6802 1.5743 1.2282 1.1572 1.7129 2.1069 1.2459 1.3695 10.5017 10.1653 1.2510 1.7189 3.5264 5.6864 1.1490 1.0419 1.0984 3.4501 1.0486 1.0795 8.1892 8.1313 10.8195 1.0564 1.0557 1.1042 1.1052 1.0359 1.0580 1.0991 1.1011 1.1082 1.0928 1.0928 1.0929
irintensity: 0.1456 0.0235 0.2092 0.0065 1.7345 0.9409 1.9587 3.2245 9.3292 5.1208 4.6481 1.1700 0.6640 1.3626 2.5453 1.9176 2.0085 8.9826 6.0007 0.4974 5.7071 3.0505 3.4833 0.3674 2.5699 4.1905 5.5647 0.1475 2.6146 42.5571 24.9222 43.5150 0.0015 10.0393 4.8983 7.0236 6.3202 1.7686 14.9761 27.3326 23.5703 15.8960 28.7275 1.2769 5.4364 35.0680 46.6738 118.4340 98.9082 29.3091 5.4338 260.4989 24.4446 19.7293 228.9595 274.9737 83.1275 0.5129 0.5569 16.2147 85.0149 25.9096 5.4021 43.3430 146.8254 16.3793 12.1625 5.8339 18.4086 31.3220 12.8792 15.8177 16.9749 4.0193 5.8512 3.2454 11.4455 162.0154 28.6362 116.6171 104.2685 1.9070 18.4830 41.5459 33.5110 35.2931 8.9967 15.7360 25.0491 9.6271
temp: 298.150 k
press: 1.00000 atm
elementType: 8 8 8 8 8 8 8 7 7 6 6 6 6 6 6 6 6 6 6 6 1 1 1 1 1 1 1 1 1 1 1 1
symmnumber: 1
zpe: 602175.0 jmol-1
zpe.correction: 0.229356 hartree
zpe.thermalcorrener: 0.249039 hartree
zpe.thermalcorrenthalpy: 0.249983 hartree
zpe.thermalcorrgfe: 0.176226 hartree
zpe.sumelectzpe: -1060.767282 hartree
zpe.sumelectthermal: -1060.747599 hartree
zpe.sumelectthermalent: -1060.746655 hartree
zpe.sumelectthermalfe: -1060.820412 hartree
dipole: -6.3781 1.5261 -1.3088
dipole: 6.6875
quadrupole: -112.8950 -143.0914 -108.2614
quadrupole: -5.0278 -2.9999 0.1384
quadrupole: 8.5209 -21.6755 13.1546 -5.0278 -2.9999 0.1384
hfenergy: -1060.9966383 hartree
pointgroup: C01 [X(C11H12N2O7)]
dipole: -2.460892 0.2524747 0.895944 debye
polarizability: 200.0284927|-26.7568864|155.0008592|-32.6094525|-35.0193094|147.3573223 unknown
InChI: InChI=1S/C11H12N2O7/c1-2-19-3-4-20-11(14)8-5-9(12(15)16)7-10(6-8)13(17)18/h5-7H,2-4H2,1H3
charge 0 multiplicity 1
32 atoms
O  -1.841069 1.167744 1.264461
O  -4.276741 0.407886 -0.204746
O  -1.140983 2.54006 -0.500738
O  0.776792 -2.592943 2.778873
O  3.310502 1.52052 -2.504872
O  2.810258 -3.052164 1.850298
O  4.531508 -0.255377 -1.753059
N  1.731203 -2.355468 1.9462
N  3.492064 0.505761 -1.733458
C  0.2591 0.693555 0.241979
C  -3.157794 1.863096 1.349379
C  -4.263603 0.829101 1.191773
C  1.27192 0.999586 -0.696769
C  0.405227 -0.409156 1.114422
C  1.574089 -1.190255 1.027994
C  2.420771 0.187716 -0.744119
C  2.603058 -0.918126 0.107544
C  -0.960472 1.569569 0.268049
C  -5.262705 -0.653901 -0.472115
C  -5.163994 -1.006024 -1.955041
H  -3.191631 2.332395 2.347217
H  -3.210242 2.629054 0.557154
H  -5.233371 1.298373 1.477635
H  -4.08443 -0.03543 1.868502
H  1.156966 1.852298 -1.372439
H  -0.371581 -0.654821 1.841351
H  3.502424 -1.536742 0.054682
H  -5.04102 -1.538081 0.166247
H  -6.282484 -0.289954 -0.214573
H  -5.888971 -1.799573 -2.211651
H  -5.377227 -0.120265 -2.577419
H  -4.149662 -1.364537 -2.200261
