program: Gaussian 09
title: 000242176
version: EM64L-G09RevD.01
frameworkgroup: C1[X(C18H24N4)]
method: RPBEPBE
basis: SDD
operation: Freq
keyword: #pfreq=noraman
keyword: PBEPBE/SDD
title: #p freq=noraman PBEPBE/SDD
converged: YES YES NO NO
title: Mulliken charges:
elementType: N N N N C C C C C C C C C C C C C C C C C C H H H H H H H H H H H H H H H H H H H H H H H H
charge: -0.193026 -0.160457 -0.067214 -0.045948 -0.367393 -0.361014 -0.453393 -0.456852 -0.402662 -0.367466 -0.398567 -0.395910 -0.422056 -0.405659 0.088052 0.096660 0.065579 0.060138 -0.346486 -0.348295 -0.230532 -0.233084 0.247910 0.235402 0.240817 0.238524 0.222039 0.227284 0.215598 0.230389 0.214866 0.252292 0.238617 0.208977 0.202255 0.213272 0.198856 0.197531 0.203634 0.205473 0.206360 0.200559 0.248329 0.248140 0.224081 0.224381
chargesum: 0.00000
title: Mulliken charges with hydrogens summed into heavy atoms:
elementType: N N N N C C C C C C C C C C C C C C C C C C
charge: -0.193026 -0.160457 -0.067214 -0.045948 0.115919 0.118327 -0.004071 -0.010865 0.064496 0.080129 0.016959 0.000477 -0.012949 0.001260 0.088052 0.096660 0.065579 0.060138 -0.098158 -0.100155 -0.006451 -0.008703
polarizability: 3.42157446e+02 -3.41826393e+01 2.42432688e+02 -7.02844555e+00 -1.49639393e+01 1.40374336e+02
1716.lowfreq: -16.6627 -12.0217 -4.6610 0.0002 0.0003 0.0005 38.2237 44.4131 48.5011
frequency: 37.8440 44.3599 48.4761 63.0658 83.3786 102.1534 117.8219 127.4100 148.2201 194.1731 225.2328 236.9398 251.2926 260.4280 290.6260 309.7800 319.5076 337.9371 349.4313 360.1217 366.3516 416.3981 475.1634 504.2111 524.4736 547.9093 563.4123 567.4052 574.6634 595.5425 606.1994 655.2725 709.1127 733.3572 746.5862 753.2309 764.4442 780.5932 795.9367 838.6368 855.3715 856.7280 867.5510 869.1396 874.9196 898.5664 914.0708 918.2204 939.1430 950.6921 955.4650 967.7107 978.5336 979.5935 1005.3771 1012.4514 1032.6017 1056.0993 1065.3071 1097.2514 1107.7781 1116.5615 1128.4037 1140.4778 1151.6762 1156.0296 1157.6911 1168.7842 1176.6674 1198.6396 1210.6124 1217.9573 1221.5533 1235.5769 1243.0399 1267.4332 1277.5334 1279.3898 1293.4593 1299.6288 1309.9367 1319.1780 1328.3277 1334.3612 1339.8386 1340.9859 1346.1484 1350.8473 1360.3309 1362.1419 1377.4041 1384.8225 1447.4004 1453.2842 1457.9216 1458.9083 1464.6567 1468.1647 1469.0735 1470.0150 1475.0432 1475.5936 1483.3330 1488.8398 1495.9647 1511.1074 1549.0344 1610.0683 2915.5343 2929.5705 2965.2760 2974.0611 2981.7528 2988.4922 2988.7467 3000.7866 3004.8309 3006.1732 3013.6758 3032.5883 3036.1934 3051.3927 3058.8853 3060.5780 3062.6564 3069.5384 3077.3779 3089.8693 3126.2503 3140.2848 3155.1062 3166.5381
redmass: 2.8419 3.6320 3.8154 2.8374 3.1791 2.9297 2.8771 4.1717 2.3610 3.5961 3.7600 4.1334 2.5228 1.6736 3.6285 2.6773 3.5134 3.5292 3.6964 3.3532 4.1231 2.2802 3.3427 2.1139 5.8063 3.6730 3.7139 2.2162 5.5759 7.4509 6.1945 3.0346 3.0613 4.9033 4.2457 1.3317 1.2884 4.6091 3.5091 2.4808 2.2020 2.4138 1.5805 1.9816 1.6265 3.9771 1.6093 2.4743 2.1342 1.3685 2.1812 2.0489 2.1875 1.3316 1.7901 2.0014 2.5863 1.7677 2.1629 2.0296 1.8779 1.6166 2.7260 2.7343 1.8452 1.6387 1.3084 1.5728 1.4178 1.5156 1.5666 1.6553 1.2679 1.4619 1.5008 1.4098 1.2646 1.5080 1.8399 1.4470 1.3084 2.0599 1.7235 1.3846 1.5175 1.4510 2.0103 1.7518 1.3937 1.3989 1.6334 3.5414 3.8808 1.1008 1.8148 3.0258 1.2085 1.1131 1.1014 1.3557 1.2316 1.0958 1.1104 1.0927 1.1604 4.1321 6.6194 6.7333 1.0721 1.0709 1.0593 1.0633 1.0620 1.0647 1.0648 1.0622 1.0656 1.0617 1.0978 1.1002 1.1008 1.1001 1.0984 1.0893 1.0907 1.0991 1.1016 1.1057 1.0849 1.0891 1.0952 1.1004
irintensity: 0.0180 0.4184 0.3752 0.4346 2.7808 0.7279 1.7557 1.4596 1.7305 2.5858 3.7137 0.6564 1.3842 0.3333 21.1967 7.2657 1.0016 3.5613 1.9595 0.4211 9.0571 3.2325 2.9811 5.7970 9.1631 2.5607 5.8256 0.6339 0.7327 14.1097 5.4207 3.7292 0.5969 0.9131 5.9250 20.4455 93.0949 0.1436 0.1137 8.7382 10.5263 12.2674 0.0803 4.6223 3.2547 11.8168 0.4854 12.2994 9.8213 3.1987 10.9827 3.4123 6.0296 0.3254 11.6939 20.0235 7.6476 0.5088 13.0011 3.5644 2.2968 2.1630 8.7711 9.9261 6.1731 12.4550 16.7375 46.9666 25.3054 41.1641 4.8588 12.1075 8.5121 10.0584 64.8074 18.6585 29.8648 24.4487 10.6670 13.8135 0.7129 0.8590 16.3968 4.7631 12.3267 8.3732 0.9648 34.3934 0.9103 10.0094 38.1608 38.8395 324.0463 5.7497 235.3151 6.9072 37.7677 10.7499 9.4277 61.3433 26.3581 16.1738 7.9232 7.4522 24.7130 129.5740 3.5396 0.2896 59.3839 39.7854 15.1808 63.3985 35.6035 35.0173 32.6098 41.7390 39.2726 32.6095 19.5841 70.3836 41.9051 65.5397 26.7709 27.7714 14.3691 19.5880 30.2917 61.6130 1.1831 9.6986 26.5802 41.2220
temp: 298.150 k
press: 1.00000 atm
elementType: 7 7 7 7 6 6 6 6 6 6 6 6 6 6 6 6 6 6 6 6 6 6 1 1 1 1 1 1 1 1 1 1 1 1 1 1 1 1 1 1 1 1 1 1 1 1
symmnumber: 1
zpe: 1031179.1 jmol-1
zpe.correction: 0.392755 hartree
zpe.thermalcorrener: 0.411995 hartree
zpe.thermalcorrenthalpy: 0.412939 hartree
zpe.thermalcorrgfe: 0.344936 hartree
zpe.sumelectzpe: -917.676949 hartree
zpe.sumelectthermal: -917.657710 hartree
zpe.sumelectthermalent: -917.656766 hartree
zpe.sumelectthermalfe: -917.724768 hartree
dipole: -3.7576 1.6951 0.2795
dipole: 4.1317
quadrupole: -124.7464 -121.5569 -132.2312
quadrupole: -0.9989 0.1988 0.1429
quadrupole: 1.4317 4.6213 -6.0530 -0.9989 0.1988 0.1429
hfenergy: -918.0697046 hartree
pointgroup: C01 [X(C18H24N4)]
dipole: -1.5710581 -0.4161325 -0.0310181 debye
polarizability: 350.7606154|15.4454312|228.2236217|-1.0120964|-27.6169558|145.9802328 unknown
InChI: InChI=1S/C18H24N4/c1-2-6-12-21(11-5-1)17-18(22-13-7-8-14-22)20-16-10-4-3-9-15(16)19-17/h3-4,9-10H,1-2,5-8,11-14H2
charge 0 multiplicity 1
46 atoms
N  -0.707591 -1.950913 0.372044
N  -1.329492 0.950798 -0.25652
N  1.526946 -1.319618 0.611388
N  1.003039 1.219564 -0.55879
C  -1.903046 -2.054937 -0.520651
C  -0.301728 -3.297189 0.876473
C  -2.049729 -3.576091 -0.764417
C  -1.518452 -4.189718 0.554858
C  -2.167101 0.810372 0.976303
C  -1.422337 2.255486 -0.971176
C  -3.690416 0.752804 0.703353
C  -2.851303 2.730306 -1.316234
C  -4.419294 2.119634 0.683265
C  -3.674433 3.23271 -0.102776
C  0.267519 -0.960641 0.273344
C  -0.013931 0.42097 -0.186253
C  2.568325 -0.444191 0.334775
C  2.311649 0.792294 -0.364341
C  3.910191 -0.795506 0.666767
C  3.403131 1.615744 -0.766359
C  4.969214 0.037135 0.277778
C  4.716813 1.241348 -0.449219
H  -1.75489 -1.475424 -1.446613
H  -2.805305 -1.663501 -0.01702
H  -0.051585 -3.244835 1.949894
H  0.611662 -3.634851 0.349115
H  -1.412644 -3.892672 -1.61116
H  -3.09162 -3.860038 -0.991119
H  -2.283637 -4.110321 1.349954
H  -1.235384 -5.251056 0.456245
H  -1.941045 1.651736 1.671344
H  -1.846456 -0.113055 1.486101
H  -0.828032 2.149693 -1.894252
H  -0.91451 3.048585 -0.377454
H  -4.164582 0.116752 1.477268
H  -3.842648 0.235661 -0.262021
H  -3.399916 1.942909 -1.869018
H  -2.721616 3.573247 -2.0238
H  -4.588379 2.466545 1.722118
H  -5.424278 1.963657 0.242955
H  -4.415503 3.983946 -0.438722
H  -2.983231 3.773393 0.575253
H  4.08174 -1.733137 1.205454
H  3.181716 2.545289 -1.301014
H  6.000454 -0.238622 0.525794
H  5.556114 1.87764 -0.751413
